{"text_format":"1","workbook":"xlsx","n_sheets":9,"sheets":["Guidance","23-24 Term 1","23-24 Term 2","23-24 Term 3","LookUps","School List","Import T1","Import T2","Import T3"],"not_rendered":{"charts":0,"images":5,"macros":1,"external_links":1,"defined_names":9,"comments":0,"pivot_tables":0},"unopened":[],"bounds":{"document_bytes":16777216,"sheet_cells":100000,"rows_first":2000,"rows_last":500,"rows_between":2000,"halvings":0,"cell_chars":16384,"cell_head_chars":4096},"cells_cut":0,"cells_raw":0,"read":"whole","date_system":"1900"}

{"sheet":"Guidance","index":0,"n_rows":51,"n_cols":1,"rows_kept":51,"cut":false,"hidden":false,"merged":[]}
["Guidance and Tips"]
[]
["This year's workbook contains 3 worksheets, one for each term, hopefully when printed each worksheet can serve as a report to governors/trustees."]
[]
["Cells that are in this colour are cells to select an answer from a list. Click in the cell and select using the drop-down arrow on the right."]
[]
["Cells in this colour are those where you can add data/text."]
[]
["Please do not add in children's names, where important to aid future discussions use initials e.g. SC"]
[]
["Tip - when you are in a cell and you want to add a new line in the cell click Alt + Enter at the same time"]
[]
["Tip - to see or edit long sentences in a cell click here"]
[]
[]
[]
[]
[]
[]
[]
{"$rows_left_out":32}
{"sheet":"23-24 Term 1","index":1,"n_rows":75,"n_cols":10,"rows_kept":75,"cut":false,"hidden":false,"merged":[[60,8,60,9],[60,2,60,4],[55,2,55,9],[13,1,13,4],[74,1,74,9],[69,1,69,9],[70,1,70,9],[71,1,71,9],[72,1,72,9],[73,1,73,9],[68,1,68,9],[64,1,64,9],[59,2,59,9],[53,2,53,9],[54,2,54,9],[56,2,56,9],[57,2,57,9],[58,2,58,9],[60,6,60,7],[15,6,15,9],[16,6,16,9],[17,6,17,9],[18,6,18,9],[19,6,19,9],[17,1,17,4],[18,1,18,4],[38,8,38,10],[39,8,39,10],[33,8,33,9],[34,7,34,8],[23,1,23,4],[24,1,24,4],[0,5,0,9],[0,0,0,4],[5,2,5,9],[6,2,6,9],[9,2,9,3],[4,7,4,8],[4,2,4,6],[7,2,7,5],[7,7,7,9],[52,2,52,9],[22,1,22,4],[3,2,3,8],[40,8,40,10],[37,8,37,10],[44,2,44,9],[45,2,45,9],[46,2,46,9],[47,2,47,9],[48,2,48,9],[19,1,19,4],[13,6,13,9],[14,6,14,9],[14,1,14,4],[15,1,15,4],[16,1,16,4]]}
["Swinderby All Saints"]
["Termly Support Meeting - School Attendance - 2023/24 Term 1"]
[]
[null,"School - ","Swinderby All Saints Church of England Primary School",null,null,null,null,null,null,{"$f":"IF(C4=\"Click in cell and use drop-down arrow on right to select school\",\"\",VLOOKUP(C4,'School List'!A4:B391,2,FALSE))","v":9253066}]
[null,"Name of school's SLT Lead - ","Zoe Longstaff",null,null,null,null,"Present at the meeting - ",null,"Yes"]
[null,"Name of LCC's Lead - ","Michelle Waddell"]
[null,"Other attendees - ","Tracey Sims"]
[null,"School email address(s) for template - ","zoe.longstaff@swinderby.lincs.sch.uk"]
[]
[null,"Date of Meeting - ","30.11.2023",null,"  DD/MM/YYYY",null,{"$f":"IF(C4=\"Click in cell and use drop-down arrow on right to select school\",\"\",\"Phase - \")","v":"Phase - "},{"$f":"IF(C4=\"Click in cell and use drop-down arrow on right to select school\",\"\",VLOOKUP(C4,'School List'!A:K,6,FALSE))","v":"Primary"}]
[null,null,null,null,null,null,{"$f":"IF(C4=\"Click in cell and use drop-down arrow on right to select school\",\"\",\"Type - \")","v":"Type - "},{"$f":"IF(C4=\"Click in cell and use drop-down arrow on right to select school\",\"\",VLOOKUP(C4,'School List'!A:K,10,FALSE))","v":"Maintained"}]
["Priorities - common priorities can be copied from right to left"]
[null,"School",null,null,null,null,"LCC"]
["1. ","Monitor attendance of all EHCP, SEN, PP & other vulnerable children",null,null,null,"1. ","Authorised absence - this is higher than national average and they are at risk of persistent absence."]
["2. ","Weekly monitoring of attendance & actions accordingly",null,null,null,"2. ","Persistent Absence (PA)"]
["3. ","Half termly attendance letters to all children",null,null,null,"3. ","Special schools"]
["4. ","Reduce the number of Persistent Absentees with the school",null,null,null,"4. ","Children with Education Health & Care Plans"]
["5. ",null,null,null,null,"5. ","Children with a social worker"]
["6. ",null,null,null,null,"6. ","Children with anxiety/school phobia"]
["7. ",null,null,null,null,"7. ","Children known to the youth offending service/Futures 4 Me"]
{"$rows_left_out":56}
{"sheet":"23-24 Term 2","index":2,"n_rows":75,"n_cols":10,"rows_kept":75,"cut":false,"hidden":false,"merged":[[5,2,5,9],[0,0,0,4],[0,5,0,9],[3,2,3,8],[4,2,4,6],[4,7,4,8],[6,2,6,9],[7,2,7,5],[7,7,7,9],[9,2,9,3],[13,1,13,4],[13,6,13,9],[14,1,14,4],[14,6,14,9],[15,1,15,4],[15,6,15,9],[16,1,16,4],[16,6,16,9],[37,8,37,10],[17,1,17,4],[17,6,17,9],[18,1,18,4],[18,6,18,9],[19,1,19,4],[19,6,19,9],[22,1,22,4],[23,1,23,4],[24,1,24,4],[33,8,33,9],[34,7,34,8],[55,2,55,9],[38,8,38,10],[39,8,39,10],[40,8,40,10],[44,2,44,9],[45,2,45,9],[46,2,46,9],[47,2,47,9],[48,2,48,9],[52,2,52,9],[53,2,53,9],[54,2,54,9],[56,2,56,9],[57,2,57,9],[58,2,58,9],[59,2,59,9],[60,2,60,4],[60,6,60,7],[60,8,60,9],[73,1,73,9],[74,1,74,9],[64,1,64,9],[68,1,68,9],[69,1,69,9],[70,1,70,9],[71,1,71,9],[72,1,72,9]]}
["       < Add your School's logo here >"]
["Termly Support Meeting - School Attendance - 2023/24 Term 2"]
[]
[null,"School - ","Click in cell and use drop-down arrow on right to select school",null,null,null,null,null,null,{"$f":"IF(C4=\"Click in cell and use drop-down arrow on right to select school\",\"\",VLOOKUP(C4,'School List'!A4:B391,2,FALSE))","v":""}]
[null,"Name of school's SLT Lead - ",null,null,null,null,null,"Present at the meeting - ",null,"Select"]
[null,"Name of LCC's Lead - "]
[null,"Other attendees - "]
[null,"School email address(s) for template - "]
[]
[null,"Date of Meeting - ",null,null,"  DD/MM/YYYY",null,{"$f":"IF(C4=\"Click in cell and use drop-down arrow on right to select school\",\"\",\"Phase - \")","v":""},{"$f":"IF(C4=\"Click in cell and use drop-down arrow on right to select school\",\"\",VLOOKUP(C4,'School List'!A:K,6,FALSE))","v":""}]
[null,null,null,null,null,null,{"$f":"IF(C4=\"Click in cell and use drop-down arrow on right to select school\",\"\",\"Type - \")","v":""},{"$f":"IF(C4=\"Click in cell and use drop-down arrow on right to select school\",\"\",VLOOKUP(C4,'School List'!A:K,10,FALSE))","v":""}]
["Priorities - common priorities can be copied from right to left"]
[null,"School",null,null,null,null,"LCC"]
["1. ",null,null,null,null,"1. ","Authorised absence - this is higher than national average and they are at risk of persistent absence."]
["2. ",null,null,null,null,"2. ","Persistent Absence (PA)"]
["3. ",null,null,null,null,"3. ","Special schools"]
["4. ",null,null,null,null,"4. ","Children with Education Health & Care Plans"]
["5. ",null,null,null,null,"5. ","Children with a social worker"]
["6. ",null,null,null,null,"6. ","Children with anxiety/school phobia"]
["7. ",null,null,null,null,"7. ","Children known to the youth offending service/Futures 4 Me"]
{"$rows_left_out":56}
{"sheet":"23-24 Term 3","index":3,"n_rows":75,"n_cols":10,"rows_kept":75,"cut":false,"hidden":false,"merged":[[5,2,5,9],[0,0,0,4],[0,5,0,9],[3,2,3,8],[4,2,4,6],[4,7,4,8],[6,2,6,9],[7,2,7,5],[7,7,7,9],[9,2,9,3],[13,1,13,4],[13,6,13,9],[14,1,14,4],[14,6,14,9],[15,1,15,4],[15,6,15,9],[16,1,16,4],[16,6,16,9],[37,8,37,10],[17,1,17,4],[17,6,17,9],[18,1,18,4],[18,6,18,9],[19,1,19,4],[19,6,19,9],[22,1,22,4],[23,1,23,4],[24,1,24,4],[33,8,33,9],[34,7,34,8],[55,2,55,9],[38,8,38,10],[39,8,39,10],[40,8,40,10],[44,2,44,9],[45,2,45,9],[46,2,46,9],[47,2,47,9],[48,2,48,9],[52,2,52,9],[53,2,53,9],[54,2,54,9],[56,2,56,9],[57,2,57,9],[58,2,58,9],[59,2,59,9],[60,2,60,4],[60,6,60,7],[60,8,60,9],[73,1,73,9],[74,1,74,9],[64,1,64,9],[68,1,68,9],[69,1,69,9],[70,1,70,9],[71,1,71,9],[72,1,72,9]]}
["       < Add your School's logo here >"]
["Termly Support Meeting - School Attendance - 2023/24 Term 3"]
[]
[null,"School - ","Click in cell and use drop-down arrow on right to select school",null,null,null,null,null,null,{"$f":"IF(C4=\"Click in cell and use drop-down arrow on right to select school\",\"\",VLOOKUP(C4,'School List'!A4:B391,2,FALSE))","v":""}]
[null,"Name of school's SLT Lead - ",null,null,null,null,null,"Present at the meeting - ",null,"Select"]
[null,"Name of LCC's Lead - "]
[null,"Other attendees - "]
[null,"School email address(s) for template - "]
[]
[null,"Date of Meeting - ",null,null,"  DD/MM/YYYY",null,{"$f":"IF(C4=\"Click in cell and use drop-down arrow on right to select school\",\"\",\"Phase - \")","v":""},{"$f":"IF(C4=\"Click in cell and use drop-down arrow on right to select school\",\"\",VLOOKUP(C4,'School List'!A:K,6,FALSE))","v":""}]
[null,null,null,null,null,null,{"$f":"IF(C4=\"Click in cell and use drop-down arrow on right to select school\",\"\",\"Type - \")","v":""},{"$f":"IF(C4=\"Click in cell and use drop-down arrow on right to select school\",\"\",VLOOKUP(C4,'School List'!A:K,10,FALSE))","v":""}]
["Priorities - common priorities can be copied from right to left"]
[null,"School",null,null,null,null,"LCC"]
["1. ",null,null,null,null,"1. ","Authorised absence - this is higher than national average and they are at risk of persistent absence."]
["2. ",null,null,null,null,"2. ","Persistent Absence (PA)"]
["3. ",null,null,null,null,"3. ","Special schools"]
["4. ",null,null,null,null,"4. ","Children with Education Health & Care Plans"]
["5. ",null,null,null,null,"5. ","Children with a social worker"]
["6. ",null,null,null,null,"6. ","Children with anxiety/school phobia"]
["7. ",null,null,null,null,"7. ","Children known to the youth offending service/Futures 4 Me"]
{"$rows_left_out":56}
{"sheet":"LookUps","index":4,"n_rows":368,"n_cols":52,"rows_kept":368,"cut":false,"hidden":true,"merged":[[10,2,10,15],[11,6,11,16],[12,4,14,4],[12,5,14,5],[12,6,12,7],[12,12,12,13],[12,2,14,2],[13,11,14,11],[13,12,14,12],[13,6,14,6],[13,7,14,7],[13,8,14,8],[13,9,14,9],[12,3,14,3],[13,10,14,10],[12,8,12,9],[12,10,12,11],[12,14,12,15],[12,16,14,16],[12,17,14,17],[13,13,14,13],[13,14,14,14],[13,15,14,15],[10,19,10,33],[11,23,11,33],[11,40,11,50],[12,19,14,19],[12,20,14,20],[12,21,14,21],[12,22,14,22],[12,23,12,24],[12,25,12,26],[12,27,12,28],[12,29,12,30],[12,31,12,32],[12,33,14,33],[12,36,14,36],[12,37,14,37],[12,38,14,38],[12,44,12,45],[12,46,12,47],[13,44,14,44],[13,45,14,45],[13,46,14,46],[13,47,14,47],[13,32,14,32],[13,40,14,40],[13,41,14,41],[13,42,14,42],[13,43,14,43],[12,39,14,39],[12,40,12,41],[12,42,12,43],[13,48,14,48],[13,49,14,49],[12,34,14,34],[12,51,14,51],[1,15,8,15],[12,48,12,49],[12,50,14,50],[13,23,14,23],[13,24,14,24],[13,25,14,25],[13,26,14,26],[13,27,14,27],[13,28,14,28],[13,29,14,29],[13,30,14,30],[13,31,14,31]]}
["Q Lookup",null,"Aut 21 - Sum 22"]
["Select",null,null,"Number of Enrolments","Attendance Thresholds",null,null,null,null,null,null,null,null,null,null,"The table left is the most recent complete year of data"]
["Yes",null,null,null,"0-50%",null,"51-79%",null,"80-90%",null,"91-94%",null,"95-100%"]
["No",null,"**  Select Phase  **",null,"Count","%","Count","%","Count","%","Count","%","Count","%"]
[null,null,"All Lincs PRI Schools",153607,1059,6.8942170604204232E-3,7718,5.0245106017303899E-2,30590,0.19914457023442941,26622,0.17331241414779275,87537,0.56987637282155112]
[null,null,"All Lincs SEC Schools",116442,3162,2.7155150203534806E-2,9268,7.9593273904604869E-2,25423,0.21833187337902132,20860,0.17914498205114993,57632,0.49494168770718472]
[null,null,"All Lincs SP Schools",4562,246,5.3923717667689608E-2,550,0.12056115738711091,927,0.20320035072336695,706,0.15475668566418238,2109,0.46229723805348533]
[null,null,"All-Through School",3735,224,5.9973226238286478E-2,408,0.10923694779116466,806,0.21579651941097724,626,0.16760374832663991,1664,0.44551539491298525]
[null,null,"All Schools in Lincs",278346,4691,1.6853125246994748E-2,17944,6.4466527271812776E-2,57746,0.20746121733382195,48814,0.17537165973285049,148942,0.53509660638198497]
[]
[null,null,"Summer 2022",null,null,null,null,null,null,null,null,null,null,null,null,null,null,null,null,"Autumn 2022",null,null,null,null,null,null,null,null,null,null,null,null,null,null,null,null,"Spring 2023"]
[null,null,null,null,null,null,"Attendance Thresholds",null,null,null,null,null,null,null,null,null,null,null,null,null,null,null,null,"Attendance Thresholds",null,null,null,null,null,null,null,null,null,null,null,null,null,null,null,null,"Attendance Thresholds"]
[null,null,"Phase","DfE No","School","Number of Enrolments","0-50%",null,"51-79%",null,"80-90%",null,"91-94%",null,"95-100%",null,"Overall Attendance %","Description",null,"Phase","DfE No","School","Number of Enrolments","0-50%",null,"51-79%",null,"80-90%",null,"91-94%",null,"95-100%",null,"Overall Attendance %","Description",null,"Phase","DfE No","School","Number of Enrolments","0-50%",null,"51-79%",null,"80-90%",null,"91-94%",null,"95-100%",null,"Overall Attendance %","Description"]
[null,null,null,null,null,null,"Count","%","Count","%","Count","%","Count","%","Count","%",null,null,null,null,null,null,null,"Count","%","Count","%","Count","%","Count","%","Count","%",null,null,null,null,null,null,null,"Count","%","Count","%","Count","%","Count","%","Count","%"]
[]
[null,null,"All-Through",9256905,"The Priory Witham Academy",859,31,3.6088474970896393E-2,99,0.11525029103608847,126,0.14668218859138532,128,0.1490104772991851,475,0.55296856810244466,0.90222445645343718,"Persistent absence",null,"Primary",9252000,"Skegness Junior Academy",319,0,0,26,8.1504702194357362E-2,74,0.23197492163009403,61,0.19122257053291536,158,0.4952978056426332,0.92327519753324339,"At risk of persistent absence",{"$f":"AL16*1","v":9252000},"Primary",9252000,"Skegness Junior Academy",322,1,3.105590062111801E-3,17,5.2795031055900624E-2,57,0.17701863354037267,58,0.18012422360248448,189,0.58695652173913049,0.94325748054656788,"At risk of persistent absence"]
[null,null,"Primary",9252000,"Skegness Junior Academy",343,6,1.7492711370262391E-2,26,7.5801749271137031E-2,44,0.1282798833819242,48,0.13994169096209913,219,0.63848396501457727,0.93524727577535627,"At risk of persistent absence",null,"Primary",9252002,"Bassingham Primary School",167,1,5.9880239520958087E-3,5,2.9940119760479042E-2,35,0.20958083832335328,34,0.20359281437125748,92,0.55089820359281438,0.93976288189694479,"At risk of persistent absence",{"$f":"AL17*1","v":9252002},"Primary",9252002,"Bassingham Primary School",163,2,1.2269938650306749E-2,4,2.4539877300613498E-2,29,0.17791411042944785,30,0.18404907975460122,98,0.60122699386503065,0.94358669833729214,"At risk of persistent absence"]
[null,null,"Primary",9252002,"Bassingham Primary School",198,1,5.0505050505050509E-3,5,2.5252525252525252E-2,19,9.5959595959595953E-2,20,0.10101010101010101,153,0.77272727272727271,0.96735459662288925,"As expected",null,"Primary",9252003,"Billingborough Primary School",117,1,8.5470085470085479E-3,7,5.9829059829059832E-2,16,0.13675213675213677,25,0.21367521367521367,68,0.58119658119658124,0.93573166047881196,"At risk of persistent absence",9252003,"Primary",9252003,"Billingborough Primary School",119,1,8.4033613445378148E-3,7,5.8823529411764705E-2,25,0.21008403361344538,28,0.23529411764705882,58,0.48739495798319327,0.92791478184736609,"At risk of persistent absence"]
[null,null,"Primary",9252003,"Billingborough Primary School",130,1,7.6923076923076927E-3,8,6.1538461538461542E-2,8,6.1538461538461542E-2,25,0.19230769230769232,88,0.67692307692307696,0.94954632939235639,"At risk of persistent absence",null,"Primary",9252004,"Ingoldmells Academy",101,1,9.9009900990099011E-3,13,0.12871287128712872,32,0.31683168316831684,17,0.16831683168316833,38,0.37623762376237624,0.90342753106942131,"Persistent absence",9252004,"Primary",9252004,"Ingoldmells Academy",98,1,1.020408163265306E-2,8,8.1632653061224483E-2,13,0.1326530612244898,23,0.23469387755102042,53,0.54081632653061229,0.93274800868935559,"At risk of persistent absence"]
[null,null,"Primary",9252004,"Ingoldmells Academy",120,0,0,9,7.4999999999999997E-2,18,0.15,17,0.14166666666666666,76,0.6333333333333333,0.94097378277153554,"At risk of persistent absence",null,"Primary",9252005,"Mablethorpe Primary Academy",293,4,1.3651877133105802E-2,21,7.1672354948805458E-2,85,0.29010238907849828,75,0.25597269624573377,108,0.36860068259385664,0.90629609502367825,"Persistent absence",9252005,"Primary",9252005,"Mablethorpe Primary Academy",292,3,1.0273972602739725E-2,27,9.2465753424657529E-2,68,0.23287671232876711,69,0.2363013698630137,125,0.42808219178082191,0.91254741313912913,"At risk of persistent absence"]
{"$rows_left_out":349}
{"sheet":"School List","index":5,"n_rows":391,"n_cols":11,"rows_kept":391,"cut":false,"hidden":true,"merged":[]}
["List of open schools in Lincolnshire - Detailed"]
[]
["Click in cell and use drop-down arrow on right to select school","DfE Number","Ofsted  URN","District Name","Post Code","Main Phase","Sub Phase","Intake Type (Secondary Schools Only)","Sixth Form ?","School Type","Open Date"]
["Acorn Free School",9251106,139774,"Countywide","LN5 9TL","PRU / AP","PRU / AP","-","-","Free School - Alternative Provision","2013-09-02"]
["Alford Primary School",9252142,120440,"East Lindsey District Council","LN13 9BJ","Primary","Primary","-","-","Maintained","-"]
["Allington with Sedgebrook Church of England Primary School",9253000,120511,"South Kesteven District Council","NG32 2DY","Primary","Primary","-","-","Maintained","-"]
["Ancaster CofE Primary School",9253001,120512,"South Kesteven District Council","NG32 3QQ","Primary","Primary","-","-","Maintained","-"]
["Aspiration House School",9256058,148189,"Boston Borough Council","PE22 0NX","Not applicable","Not applicable","Special","No","Independent","2021-01-29"]
["Ayscoughfee Hall School",9256020,120731,"South Holland District Council","PE11 2TE","Not applicable","Not applicable",null,"No","Independent","1957-10-28"]
["Barkston and Syston CofE Primary School",9255222,120689,"South Kesteven District Council","NG32 2NB","Primary","Primary","-","-","Maintained","-"]
["Barrowby Church of England Primary School",9253004,120513,"South Kesteven District Council","NG32 1BX","Primary","Primary","-","-","Maintained","-"]
["Bassingham Primary School",9252002,145437,"North Kesteven District Council","LN5 9HQ","Primary","Primary","-","-","Academy","2018-03-01"]
["Baston CE Primary School",9253005,120514,"South Kesteven District Council","PE6 9PB","Primary","Primary","-","-","Maintained","-"]
["Beacon Primary Academy",9252014,139702,"East Lindsey District Council","PE25 2RN","Primary","Primary","-","-","Academy","2014-09-01"]
["Bicker Preparatory School and Early Years",9256041,130283,"Boston Borough Council","PE20 3DW","Not applicable","Not applicable",null,"No","Independent","1996-01-23"]
["Billingborough Primary School",9252003,120371,"South Kesteven District Council","NG34 0NX","Primary","Primary","-","-","Maintained","-"]
["Binbrook CofE Primary School",9253116,120565,"East Lindsey District Council","LN8 6DU","Primary","Primary","-","-","Maintained","-"]
["Blyton Cum Laughton Church of England School",9253350,120619,"West Lindsey District Council","DN21 3JX","Primary","Primary","-","-","Maintained","-"]
["Boston Haven High Academy",9254072,138754,"Boston Borough Council","PE21 9HB","Secondary","Secondary","Selective Area","No","Academy","2012-09-01"]
["Boston Hawthorn Tree School",9252113,120424,"Boston Borough Council","PE21 0PT","Primary","Primary","-","-","Maintained","-"]
{"$rows_left_out":372}
{"sheet":"Import T1","index":6,"n_rows":53,"n_cols":49,"rows_kept":53,"cut":false,"hidden":true,"merged":[]}
["Term 1"]
[{"$f":"'23-24 Term 1'!C4:I4","v":"Swinderby All Saints Church of England Primary School"},0,0,0,0,0,0]
[{"$f":"'23-24 Term 1'!C5:G5","v":"Zoe Longstaff"},0,0,0,0]
[{"$f":"'23-24 Term 1'!J5","v":"Yes"}]
[{"$f":"'23-24 Term 1'!C6:J6","v":"Michelle Waddell"},0,0,0,0,0,0,0]
[{"$f":"'23-24 Term 1'!C7:J7","v":"Tracey Sims"},0,0,0,0,0,0,0]
[{"$f":"'23-24 Term 1'!C8:F8","v":"zoe.longstaff@swinderby.lincs.sch.uk"},0,0,0]
[{"$f":"'23-24 Term 1'!H8:J8","v":"00:00:00"},0,0]
[{"$f":"'23-24 Term 1'!H10","v":"Primary"}]
[{"$f":"'23-24 Term 1'!H11","v":"Maintained"}]
[{"$f":"'23-24 Term 1'!B14:E14","v":"Monitor attendance of all EHCP, SEN, PP & other vulnerable children"},0,0,0]
[{"$f":"'23-24 Term 1'!B15:E15","v":"Weekly monitoring of attendance & actions accordingly"},0,0,0]
[{"$f":"'23-24 Term 1'!B16:E16","v":"Half termly attendance letters to all children"},0,0,0]
[{"$f":"'23-24 Term 1'!B17:E17","v":"Reduce the number of Persistent Absentees with the school"},0,0,0]
[{"$f":"'23-24 Term 1'!B18:E18","v":0},0,0,0]
[{"$f":"'23-24 Term 1'!B19:E19","v":0},0,0,0]
[{"$f":"'23-24 Term 1'!B20:E20","v":0},0,0,0]
[{"$f":"'23-24 Term 1'!F23","v":"Yes"}]
[{"$f":"'23-24 Term 1'!F24","v":"Yes"}]
[{"$f":"'23-24 Term 1'!F25","v":"Yes"}]
{"$rows_left_out":34}
{"sheet":"Import T2","index":7,"n_rows":53,"n_cols":49,"rows_kept":53,"cut":false,"hidden":true,"merged":[]}
["Term 2"]
[{"$f":"'23-24 Term 2'!C4:I4","v":"Click in cell and use drop-down arrow on right to select school"},0,0,0,0,0,0]
[{"$f":"'23-24 Term 2'!C5:G5","v":0},0,0,0,0]
[{"$f":"'23-24 Term 2'!J5","v":"Select"}]
[{"$f":"'23-24 Term 2'!C6:J6","v":0},0,0,0,0,0,0,0]
[{"$f":"'23-24 Term 2'!C7:J7","v":0},0,0,0,0,0,0,0]
[{"$f":"'23-24 Term 2'!C8:F8","v":0},0,0,0]
[{"$f":"'23-24 Term 2'!H8:J8","v":"00:00:00"},0,0]
[{"$f":"'23-24 Term 2'!H10","v":""}]
[{"$f":"'23-24 Term 2'!H11","v":""}]
[{"$f":"'23-24 Term 2'!B14:E14","v":0},0,0,0]
[{"$f":"'23-24 Term 2'!B15:E15","v":0},0,0,0]
[{"$f":"'23-24 Term 2'!B16:E16","v":0},0,0,0]
[{"$f":"'23-24 Term 2'!B17:E17","v":0},0,0,0]
[{"$f":"'23-24 Term 2'!B18:E18","v":0},0,0,0]
[{"$f":"'23-24 Term 2'!B19:E19","v":0},0,0,0]
[{"$f":"'23-24 Term 2'!B20:E20","v":0},0,0,0]
[{"$f":"'23-24 Term 2'!F23","v":"Select"}]
[{"$f":"'23-24 Term 2'!F24","v":"Select"}]
[{"$f":"'23-24 Term 2'!F25","v":"Select"}]
{"$rows_left_out":34}
{"sheet":"Import T3","index":8,"n_rows":53,"n_cols":49,"rows_kept":53,"cut":false,"hidden":true,"merged":[]}
["Term 3"]
[{"$f":"'23-24 Term 3'!C4:I4","v":"Click in cell and use drop-down arrow on right to select school"},0,0,0,0,0,0]
[{"$f":"'23-24 Term 3'!C5:G5","v":0},0,0,0,0]
[{"$f":"'23-24 Term 3'!J5","v":"Select"}]
[{"$f":"'23-24 Term 3'!C6:J6","v":0},0,0,0,0,0,0,0]
[{"$f":"'23-24 Term 3'!C7:J7","v":0},0,0,0,0,0,0,0]
[{"$f":"'23-24 Term 3'!C8:F8","v":0},0,0,0]
[{"$f":"'23-24 Term 3'!H8:J8","v":"00:00:00"},0,0]
[{"$f":"'23-24 Term 3'!H10","v":""}]
[{"$f":"'23-24 Term 3'!H11","v":""}]
[{"$f":"'23-24 Term 3'!B14:E14","v":0},0,0,0]
[{"$f":"'23-24 Term 3'!B15:E15","v":0},0,0,0]
[{"$f":"'23-24 Term 3'!B16:E16","v":0},0,0,0]
[{"$f":"'23-24 Term 3'!B17:E17","v":0},0,0,0]
[{"$f":"'23-24 Term 3'!B18:E18","v":0},0,0,0]
[{"$f":"'23-24 Term 3'!B19:E19","v":0},0,0,0]
[{"$f":"'23-24 Term 3'!B20:E20","v":0},0,0,0]
[{"$f":"'23-24 Term 3'!F23","v":"Select"}]
[{"$f":"'23-24 Term 3'!F24","v":"Select"}]
[{"$f":"'23-24 Term 3'!F25","v":"Select"}]
{"$rows_left_out":33}