{"text_format":"1","workbook":"xlsx","n_sheets":9,"sheets":["Guidance","23-24 Term 1","23-24 Term 2","23-24 Term 3","LookUps","School List","Import T1","Import T2","Import T3"],"not_rendered":{"charts":0,"images":5,"macros":1,"external_links":1,"defined_names":9,"comments":0,"pivot_tables":0},"unopened":[],"bounds":{"document_bytes":16777216,"sheet_cells":100000,"rows_first":2000,"rows_last":500,"rows_between":2000,"halvings":0,"cell_chars":16384,"cell_head_chars":4096},"cells_cut":0,"cells_raw":0,"read":"whole","date_system":"1900"}

{"sheet":"Guidance","index":0,"n_rows":51,"n_cols":1,"rows_kept":51,"cut":false,"hidden":false,"merged":[]}
["Guidance and Tips"]
[]
["This year's workbook contains 3 worksheets, one for each term, hopefully when printed each worksheet can serve as a report to governors/trustees."]
[]
["Cells that are in this colour are cells to select an answer from a list. Click in the cell and select using the drop-down arrow on the right."]
[]
["Cells in this colour are those where you can add data/text."]
[]
["Please do not add in children's names, where important to aid future discussions use initials e.g. SC"]
[]
["Tip - when you are in a cell and you want to add a new line in the cell click Alt + Enter at the same time"]
[]
["Tip - to see or edit long sentences in a cell click here"]
[]
[]
[]
[]
[]
[]
[]
[]
[]
[]
[]
[]
[]
[]
[]
[]
[]
[]
["Tip - if you can't see all the text that you have typed then you can resize the row by moving your mouse over the dividing line between rows"]
[]
[]
[]
[]
[]
[]
[]
[]
[]
[]
["Notes for the 23-24 academic year"]
["1. there have been some changes made to the formatting of the workbooks following feedback from the summer term"]
["2. this workbook contains three templates, one for each term"]
["3. the saved filename is key please DO NOT rename the copy that you send back to us, you will keep your own copy which you can name"]
["        whatever suits your filing system"]
["4. the syntax of the filename is  TSM Template, Academic Yr, hyphen, Term, hyphen, 8 digit DfE number"]
["e.g. for term 1 it will be: TSM Template Yr2023-24-T1-9251234"]
["                                   term 2 TSM Template Yr2023-24-T2-9251234"]
["                                   term 3 TSM Template Yr2023-24-T3-9251235"]

{"sheet":"23-24 Term 1","index":1,"n_rows":75,"n_cols":10,"rows_kept":75,"cut":false,"hidden":false,"merged":[[60,8,60,9],[60,2,60,4],[55,2,55,9],[13,1,13,4],[74,1,74,9],[69,1,69,9],[70,1,70,9],[71,1,71,9],[72,1,72,9],[73,1,73,9],[68,1,68,9],[64,1,64,9],[59,2,59,9],[53,2,53,9],[54,2,54,9],[56,2,56,9],[57,2,57,9],[58,2,58,9],[60,6,60,7],[15,6,15,9],[16,6,16,9],[17,6,17,9],[18,6,18,9],[19,6,19,9],[17,1,17,4],[18,1,18,4],[38,8,38,10],[39,8,39,10],[33,8,33,9],[34,7,34,8],[23,1,23,4],[24,1,24,4],[0,5,0,9],[0,0,0,4],[5,2,5,9],[6,2,6,9],[9,2,9,3],[4,7,4,8],[4,2,4,6],[7,2,7,5],[7,7,7,9],[52,2,52,9],[22,1,22,4],[3,2,3,8],[40,8,40,10],[37,8,37,10],[44,2,44,9],[45,2,45,9],[46,2,46,9],[47,2,47,9],[48,2,48,9],[19,1,19,4],[13,6,13,9],[14,6,14,9],[14,1,14,4],[15,1,15,4],[16,1,16,4]]}
["Swinderby All Saints"]
["Termly Support Meeting - School Attendance - 2023/24 Term 1"]
[]
[null,"School - ","Swinderby All Saints Church of England Primary School",null,null,null,null,null,null,{"$f":"IF(C4=\"Click in cell and use drop-down arrow on right to select school\",\"\",VLOOKUP(C4,'School List'!A4:B391,2,FALSE))","v":9253066}]
[null,"Name of school's SLT Lead - ","Zoe Longstaff",null,null,null,null,"Present at the meeting - ",null,"Yes"]
[null,"Name of LCC's Lead - ","Michelle Waddell"]
[null,"Other attendees - ","Tracey Sims"]
[null,"School email address(s) for template - ","zoe.longstaff@swinderby.lincs.sch.uk"]
[]
[null,"Date of Meeting - ","30.11.2023",null,"  DD/MM/YYYY",null,{"$f":"IF(C4=\"Click in cell and use drop-down arrow on right to select school\",\"\",\"Phase - \")","v":"Phase - "},{"$f":"IF(C4=\"Click in cell and use drop-down arrow on right to select school\",\"\",VLOOKUP(C4,'School List'!A:K,6,FALSE))","v":"Primary"}]
[null,null,null,null,null,null,{"$f":"IF(C4=\"Click in cell and use drop-down arrow on right to select school\",\"\",\"Type - \")","v":"Type - "},{"$f":"IF(C4=\"Click in cell and use drop-down arrow on right to select school\",\"\",VLOOKUP(C4,'School List'!A:K,10,FALSE))","v":"Maintained"}]
["Priorities - common priorities can be copied from right to left"]
[null,"School",null,null,null,null,"LCC"]
["1. ","Monitor attendance of all EHCP, SEN, PP & other vulnerable children",null,null,null,"1. ","Authorised absence - this is higher than national average and they are at risk of persistent absence."]
["2. ","Weekly monitoring of attendance & actions accordingly",null,null,null,"2. ","Persistent Absence (PA)"]
["3. ","Half termly attendance letters to all children",null,null,null,"3. ","Special schools"]
["4. ","Reduce the number of Persistent Absentees with the school",null,null,null,"4. ","Children with Education Health & Care Plans"]
["5. ",null,null,null,null,"5. ","Children with a social worker"]
["6. ",null,null,null,null,"6. ","Children with anxiety/school phobia"]
["7. ",null,null,null,null,"7. ","Children known to the youth offending service/Futures 4 Me"]
[]
["Policies, processes and documents"]
[null,"Is there a clear attendance policy on the school's website?",null,null,null,"Yes"]
[null,"Has the school signed up to sharing data with the DfE?",null,null,null,"Yes"]
[null,"Are there robust daily processes for following up absence?",null,null,null,"Yes"]
[]
["Key data"]
[null,"School's current % attendance - only add numbers in cells not a % sign"]
[]
[null,"School Profile","Severe","At risk of severe","PA","At risk of PA","Expected"]
[null,"Group","0-50%","51-79%","80-90%","91-94%","95-100%","Total"]
[null,"No of children in each band ",0,1,5,5,81,{"$f":"SUM(C32:G32)","v":92},"Overall %"]
[null,"% ",{"$f":"IF(C32=\"\",\"\",C32/$H$32)","v":0},{"$f":"IF(D32=\"\",\"\",D32/$H$32)","v":1.0869565217391304E-2},5.434782608695652E-2,5.434782608695652E-2,0.88043478260869568,null,96.49]
[null,"All Lincs PRI Schools",{"$f":"IF($B$34=\"**  Select Phase  **\",\" - \",VLOOKUP($B$34,LookUps!$C$5:$N$9,4,FALSE))","v":6.8942170604204232E-3},{"$f":"IF($B$34=\"**  Select Phase  **\",\" - \",VLOOKUP($B$34,LookUps!$C$5:$N$9,6,FALSE))","v":5.0245106017303899E-2},{"$f":"IF($B$34=\"**  Select Phase  **\",\" - \",VLOOKUP($B$34,LookUps!$C$5:$N$9,8,FALSE))","v":0.19914457023442941},{"$f":"IF($B$34=\"**  Select Phase  **\",\" - \",VLOOKUP($B$34,LookUps!$C$5:$N$9,10,FALSE))","v":0.17331241414779275},{"$f":"IF($B$34=\"**  Select Phase  **\",\" - \",VLOOKUP($B$34,LookUps!$C$5:$N$9,12,FALSE))","v":0.56987637282155112},null,{"$f":"IF(I33>=95,\"Expected attendance rate\",IF(I33>=91,\"At risk of persistent absence\",(IF(I33>=80,\"Persistent absence\",IF(I33>=51,\"At risk of severe absence\",IF(I33>0,\"Severe absence\",\"\"))))))","v":"Expected attendance rate"}]
[null,"Difference ",{"$f":"IF(C32=\"\",\" - \",C33-C34)","v":-6.8942170604204232E-3},{"$f":"IF(D32=\"\",\" - \",D33-D34)","v":-3.9375540799912595E-2},{"$f":"IF(E32=\"\",\" - \",E33-E34)","v":-0.1447967441474729},{"$f":"IF(F32=\"\",\" - \",F33-F34)","v":-0.11896458806083623},{"$f":"IF(G32=\"\",\" - \",G33-G34)","v":0.31055840978714455},{"$f":"IF(H32>0,\"  One child is equal to \"&ROUND(((1/H32)*100),1)&\" %\",\"\")","v":"  One child is equal to 1.1 %"}]
[]
[null,"School's historical % attendance - school census"]
[null,null,null,null,null,null,null,"Overall %"]
[null,"Spring 2023",{"$f":"IF(J4=\"\",\"\",VLOOKUP($J$4,LookUps!$AL$16:$AZ$368,5,FALSE))","v":0},{"$f":"IF(J4=\"\",\"\",VLOOKUP($J$4,LookUps!$AL$16:$AZ$368,7,FALSE))","v":2.7397260273972601E-2},{"$f":"IF(J4=\"\",\"\",VLOOKUP($J$4,LookUps!$AL$16:$AZ$368,9,FALSE))","v":6.8493150684931503E-2},{"$f":"IF(J4=\"\",\"\",VLOOKUP($J$4,LookUps!$AL$16:$AZ$368,11,FALSE))","v":0.17808219178082191},{"$f":"IF(J4=\"\",\"\",VLOOKUP($J$4,LookUps!$AL$16:$AZ$368,13,FALSE))","v":0.72602739726027399},{"$f":"IF(J4=\"\",\"\",VLOOKUP($J$4,LookUps!$AL$16:$AZ$368,14,FALSE))","v":0.96235011990407671},{"$f":"IF(J4=\"\",\"\",\"  \"&VLOOKUP($J$4,LookUps!$AL$16:$AZ$368,15,FALSE))","v":"  As expected"}]
[null,"Autumn 2022",{"$f":"IF(J4=\"\",\"\",VLOOKUP($J$4,LookUps!$U$16:$AI$368,5,FALSE))","v":0},{"$f":"IF(J4=\"\",\"\",VLOOKUP($J$4,LookUps!$U$16:$AI$368,7,FALSE))","v":1.4084507042253521E-2},{"$f":"IF(J4=\"\",\"\",VLOOKUP($J$4,LookUps!$U$16:$AI$368,9,FALSE))","v":0.14084507042253522},{"$f":"IF(J4=\"\",\"\",VLOOKUP($J$4,LookUps!$U$16:$AI$368,11,FALSE))","v":0.16901408450704225},{"$f":"IF(J4=\"\",\"\",VLOOKUP($J$4,LookUps!$U$16:$AI$368,13,FALSE))","v":0.676056338028169},{"$f":"IF(J4=\"\",\"\",VLOOKUP($J$4,LookUps!$U$16:$AI$368,14,FALSE))","v":0.95395729997843437},{"$f":"IF(J4=\"\",\"\",\"  \"&VLOOKUP($J$4,LookUps!$U$16:$AI$368,15,FALSE))","v":"  As expected"}]
[null,"Summer 2022",{"$f":"IF(J4=\"\",\"\",VLOOKUP($J$4,LookUps!$D$16:$R$368,5,FALSE))","v":0},{"$f":"IF(J4=\"\",\"\",VLOOKUP($J$4,LookUps!$D$16:$R$368,7,FALSE))","v":5.1948051948051951E-2},{"$f":"IF(J4=\"\",\"\",VLOOKUP($J$4,LookUps!$D$16:$R$368,9,FALSE))","v":0.12987012987012986},{"$f":"IF(J4=\"\",\"\",VLOOKUP($J$4,LookUps!$D$16:$R$368,11,FALSE))","v":9.0909090909090912E-2},{"$f":"IF(J4=\"\",\"\",VLOOKUP($J$4,LookUps!$D$16:$R$368,13,FALSE))","v":0.72727272727272729},{"$f":"IF(J4=\"\",\"\",VLOOKUP($J$4,LookUps!$D$16:$R$368,14,FALSE))","v":0.95141895141895139},{"$f":"IF(J4=\"\",\"\",\"  \"&VLOOKUP($J$4,LookUps!$D$16:$R$368,15,FALSE))","v":"  As expected"}]
[]
["Discussion points"]
[]
[null,"Expected\n100-95%","* Looking at any potential patterns of absence\n* Reporting on newsletters, on the school website, directly to parents and staff (individual classes & whole school)\n* Contacting parents when children absent, bringing children into school (if missed bus for e.g.), administer any medicine\n* Half termly letters to all pupils\n* Staff updated regularly\n"]
[null,"At risk of persistent absence\n94-91%","* 1x child off with COVID\n* 1x child with anxiety around school. Working with parents. In school daily but late\n* 1x child on TAC - child brought into school by HT if needs be. \n* 1x Y6 child - warning letters have been issued and parents invited in for meeting with Head\n* 1x Y6 child had a lot of illness at start of year. No concerns as attendance has been high throughout previous years\n"]
[null,"Persistent absence\n90-80%","* 1x YR child temporary timetable at very start of academic year (first 2 weeks only) and illness\n* 2x children with unauthorised holiday. Fined and paid immediately\n* 2x children with unauthorised holiday, did not fine due to higher attendance previous year but warning letter. Younger sibling not of compulsory school age\n* \n* \n"]
[null,"At risk of severe absence\n79-51%","* 1x EHCP child, complex medical needs. School to complete Early Help Assessment to support parents. Referral to WTT, Specialist nurse. \n* \n* \n* \n* \n"]
[null,"Severe absence\n50-0%","* \n* \n* \n* \n* \n"]
[]
["Groups of children"]
[]
[null,"Children with an Education, health & care plan","* 90.4%. Complex medical needs. School to complete Early Help Assessment to support parents. Referral to WTT and Special nurse\n* \n* \n* \n* \n"]
[null,"Children with a social worker","* \n* \n* \n* \n* \n"]
[null,"Children anxiety/school phobia","* 1x Y5 child - school refuser. EP involvement, TAC, community Paediatrics  and Healthy Minds\n* \n* \n* \n* \n"]
[null,"Children known to youth offending service/Futures4Me","* \n* \n* \n* \n* \n"]
[null,"Children eligible for FSM","* \n* \n* \n* \n* \n"]
[null,"Gender","* No Concerns\n* \n* \n* \n* \n"]
[null,"Ethnicity","* No Concerns\n* \n* \n* \n* \n"]
[null,"Other(s) e.g. pupil leavers and joiners/ EHE / CME","* 1x Y1 child left July 2023 to be home schooled. This was due to religious reasons. Reported to LCC\n* \n* \n* \n* \n"]
[null,"Number of children in an alternative provision setting",0,null,null,null,"Number of children on a reduced timetable",null,0]
[]
["What's working well for the school?"]
[]
[null,"* High levels of monitoring\n* Effective use of attendance policy\n* Rigorour and consistent approach to following up concerns\n* Introduction of fining\n* Making good use of external agencies to support families and pupils\n"]
[]
["School's Action points"]
[]
["1. ","Continue to be vigilant and rigorous in application of attendance policy"]
["2. ","Monitor the impact of fining"]
["3. ","Ensure families needing support are placed on Early Help Form and help sought"]
["4. "]
["5. "]
["6. "]
["7. "]

{"sheet":"23-24 Term 2","index":2,"n_rows":75,"n_cols":10,"rows_kept":75,"cut":false,"hidden":false,"merged":[[5,2,5,9],[0,0,0,4],[0,5,0,9],[3,2,3,8],[4,2,4,6],[4,7,4,8],[6,2,6,9],[7,2,7,5],[7,7,7,9],[9,2,9,3],[13,1,13,4],[13,6,13,9],[14,1,14,4],[14,6,14,9],[15,1,15,4],[15,6,15,9],[16,1,16,4],[16,6,16,9],[37,8,37,10],[17,1,17,4],[17,6,17,9],[18,1,18,4],[18,6,18,9],[19,1,19,4],[19,6,19,9],[22,1,22,4],[23,1,23,4],[24,1,24,4],[33,8,33,9],[34,7,34,8],[55,2,55,9],[38,8,38,10],[39,8,39,10],[40,8,40,10],[44,2,44,9],[45,2,45,9],[46,2,46,9],[47,2,47,9],[48,2,48,9],[52,2,52,9],[53,2,53,9],[54,2,54,9],[56,2,56,9],[57,2,57,9],[58,2,58,9],[59,2,59,9],[60,2,60,4],[60,6,60,7],[60,8,60,9],[73,1,73,9],[74,1,74,9],[64,1,64,9],[68,1,68,9],[69,1,69,9],[70,1,70,9],[71,1,71,9],[72,1,72,9]]}
["       < Add your School's logo here >"]
["Termly Support Meeting - School Attendance - 2023/24 Term 2"]
[]
[null,"School - ","Click in cell and use drop-down arrow on right to select school",null,null,null,null,null,null,{"$f":"IF(C4=\"Click in cell and use drop-down arrow on right to select school\",\"\",VLOOKUP(C4,'School List'!A4:B391,2,FALSE))","v":""}]
[null,"Name of school's SLT Lead - ",null,null,null,null,null,"Present at the meeting - ",null,"Select"]
[null,"Name of LCC's Lead - "]
[null,"Other attendees - "]
[null,"School email address(s) for template - "]
[]
[null,"Date of Meeting - ",null,null,"  DD/MM/YYYY",null,{"$f":"IF(C4=\"Click in cell and use drop-down arrow on right to select school\",\"\",\"Phase - \")","v":""},{"$f":"IF(C4=\"Click in cell and use drop-down arrow on right to select school\",\"\",VLOOKUP(C4,'School List'!A:K,6,FALSE))","v":""}]
[null,null,null,null,null,null,{"$f":"IF(C4=\"Click in cell and use drop-down arrow on right to select school\",\"\",\"Type - \")","v":""},{"$f":"IF(C4=\"Click in cell and use drop-down arrow on right to select school\",\"\",VLOOKUP(C4,'School List'!A:K,10,FALSE))","v":""}]
["Priorities - common priorities can be copied from right to left"]
[null,"School",null,null,null,null,"LCC"]
["1. ",null,null,null,null,"1. ","Authorised absence - this is higher than national average and they are at risk of persistent absence."]
["2. ",null,null,null,null,"2. ","Persistent Absence (PA)"]
["3. ",null,null,null,null,"3. ","Special schools"]
["4. ",null,null,null,null,"4. ","Children with Education Health & Care Plans"]
["5. ",null,null,null,null,"5. ","Children with a social worker"]
["6. ",null,null,null,null,"6. ","Children with anxiety/school phobia"]
["7. ",null,null,null,null,"7. ","Children known to the youth offending service/Futures 4 Me"]
[]
["Policies, processes and documents"]
[null,"Is there a clear attendance policy on the school's website?",null,null,null,"Select"]
[null,"Has the school signed up to sharing data with the DfE?",null,null,null,"Select"]
[null,"Are there robust daily processes for following up absence?",null,null,null,"Select"]
[]
["Key data"]
[null,"School's current % attendance - only add numbers in cells not a % sign"]
[]
[null,"School Profile","Severe","At risk of severe","PA","At risk of PA","Expected"]
[null,"Group","0-50%","51-79%","80-90%","91-94%","95-100%","Total"]
[null,"No of children in each band ",null,null,null,null,null,{"$f":"SUM(C32:G32)","v":0},"Overall %"]
[null,"% ",{"$f":"IF(C32=\"\",\"\",C32/$H$32)","v":""},{"$f":"IF(D32=\"\",\"\",D32/$H$32)","v":""},"","",""]
[null,"**  Select Phase  **",{"$f":"IF($B$34=\"**  Select Phase  **\",\" - \",VLOOKUP($B$34,LookUps!$C$5:$N$9,4,FALSE))","v":" - "},{"$f":"IF($B$34=\"**  Select Phase  **\",\" - \",VLOOKUP($B$34,LookUps!$C$5:$N$9,6,FALSE))","v":" - "},{"$f":"IF($B$34=\"**  Select Phase  **\",\" - \",VLOOKUP($B$34,LookUps!$C$5:$N$9,8,FALSE))","v":" - "},{"$f":"IF($B$34=\"**  Select Phase  **\",\" - \",VLOOKUP($B$34,LookUps!$C$5:$N$9,10,FALSE))","v":" - "},{"$f":"IF($B$34=\"**  Select Phase  **\",\" - \",VLOOKUP($B$34,LookUps!$C$5:$N$9,12,FALSE))","v":" - "},null,{"$f":"IF(I33>=95,\"Expected attendance rate\",IF(I33>=91,\"At risk of persistent absence\",(IF(I33>=80,\"Persistent absence\",IF(I33>=51,\"At risk of severe absence\",IF(I33>0,\"Severe absence\",\"\"))))))","v":""}]
[null,"Difference ",{"$f":"IF(C32=\"\",\" - \",C33-C34)","v":" - "},{"$f":"IF(D32=\"\",\" - \",D33-D34)","v":" - "},{"$f":"IF(E32=\"\",\" - \",E33-E34)","v":" - "},{"$f":"IF(F32=\"\",\" - \",F33-F34)","v":" - "},{"$f":"IF(G32=\"\",\" - \",G33-G34)","v":" - "},{"$f":"IF(H32>0,\"  One child is equal to \"&ROUND(((1/H32)*100),1)&\" %\",\"\")","v":""}]
[]
[null,"School's historical % attendance - school census"]
[null,null,null,null,null,null,null,"Overall %"]
[null,"Spring 2023",{"$f":"IF(J4=\"\",\"\",VLOOKUP($J$4,LookUps!$AL$16:$AZ$368,5,FALSE))","v":""},{"$f":"IF(J4=\"\",\"\",VLOOKUP($J$4,LookUps!$AL$16:$AZ$368,7,FALSE))","v":""},{"$f":"IF(J4=\"\",\"\",VLOOKUP($J$4,LookUps!$AL$16:$AZ$368,9,FALSE))","v":""},{"$f":"IF(J4=\"\",\"\",VLOOKUP($J$4,LookUps!$AL$16:$AZ$368,11,FALSE))","v":""},{"$f":"IF(J4=\"\",\"\",VLOOKUP($J$4,LookUps!$AL$16:$AZ$368,13,FALSE))","v":""},{"$f":"IF(J4=\"\",\"\",VLOOKUP($J$4,LookUps!$AL$16:$AZ$368,14,FALSE))","v":""},{"$f":"IF(J4=\"\",\"\",\"  \"&VLOOKUP($J$4,LookUps!$AL$16:$AZ$368,15,FALSE))","v":""}]
[null,"Autumn 2022",{"$f":"IF(J4=\"\",\"\",VLOOKUP($J$4,LookUps!$U$16:$AI$368,5,FALSE))","v":""},{"$f":"IF(J4=\"\",\"\",VLOOKUP($J$4,LookUps!$U$16:$AI$368,7,FALSE))","v":""},{"$f":"IF(J4=\"\",\"\",VLOOKUP($J$4,LookUps!$U$16:$AI$368,9,FALSE))","v":""},{"$f":"IF(J4=\"\",\"\",VLOOKUP($J$4,LookUps!$U$16:$AI$368,11,FALSE))","v":""},{"$f":"IF(J4=\"\",\"\",VLOOKUP($J$4,LookUps!$U$16:$AI$368,13,FALSE))","v":""},{"$f":"IF(J4=\"\",\"\",VLOOKUP($J$4,LookUps!$U$16:$AI$368,14,FALSE))","v":""},{"$f":"IF(J4=\"\",\"\",\"  \"&VLOOKUP($J$4,LookUps!$U$16:$AI$368,15,FALSE))","v":""}]
[null,"Summer 2022",{"$f":"IF(J4=\"\",\"\",VLOOKUP($J$4,LookUps!$D$16:$R$368,5,FALSE))","v":""},{"$f":"IF(J4=\"\",\"\",VLOOKUP($J$4,LookUps!$D$16:$R$368,7,FALSE))","v":""},{"$f":"IF(J4=\"\",\"\",VLOOKUP($J$4,LookUps!$D$16:$R$368,9,FALSE))","v":""},{"$f":"IF(J4=\"\",\"\",VLOOKUP($J$4,LookUps!$D$16:$R$368,11,FALSE))","v":""},{"$f":"IF(J4=\"\",\"\",VLOOKUP($J$4,LookUps!$D$16:$R$368,13,FALSE))","v":""},{"$f":"IF(J4=\"\",\"\",VLOOKUP($J$4,LookUps!$D$16:$R$368,14,FALSE))","v":""},{"$f":"IF(J4=\"\",\"\",\"  \"&VLOOKUP($J$4,LookUps!$D$16:$R$368,15,FALSE))","v":""}]
[]
["Discussion points"]
[]
[null,"Expected\n100-95%","* \n* \n* \n* \n* \n"]
[null,"At risk of persistent absence\n94-91%","* \n* \n* \n* \n* \n"]
[null,"Persistent absence\n90-80%","* \n* \n* \n* \n* \n"]
[null,"At risk of severe absence\n79-51%","* \n* \n* \n* \n* \n"]
[null,"Severe absence\n50-0%","* \n* \n* \n* \n* \n"]
[]
["Groups of children"]
[]
[null,"Children with an Education, health & care plan","* \n* \n* \n* \n* \n"]
[null,"Children with a social worker","* \n* \n* \n* \n* \n"]
[null,"Children anxiety/school phobia","* \n* \n* \n* \n* \n"]
[null,"Children known to youth offending service/Futures4Me","* \n* \n* \n* \n* \n"]
[null,"Children eligible for FSM","* \n* \n* \n* \n* \n"]
[null,"Gender","* \n* \n* \n* \n* \n"]
[null,"Ethnicity","* \n* \n* \n* \n* \n"]
[null,"Other(s) e.g. pupil leavers and joiners/ EHE / CME","* \n* \n* \n* \n* \n"]
[null,"Number of children in an alternative provision setting",null,null,null,null,"Number of children on a reduced timetable"]
[]
["What's working well for the school?"]
[]
[null,"* \n* \n* \n* \n* \n"]
[]
["School's Action points"]
[]
["1. "]
["2. "]
["3. "]
["4. "]
["5. "]
["6. "]
["7. "]

{"sheet":"23-24 Term 3","index":3,"n_rows":75,"n_cols":10,"rows_kept":75,"cut":false,"hidden":false,"merged":[[5,2,5,9],[0,0,0,4],[0,5,0,9],[3,2,3,8],[4,2,4,6],[4,7,4,8],[6,2,6,9],[7,2,7,5],[7,7,7,9],[9,2,9,3],[13,1,13,4],[13,6,13,9],[14,1,14,4],[14,6,14,9],[15,1,15,4],[15,6,15,9],[16,1,16,4],[16,6,16,9],[37,8,37,10],[17,1,17,4],[17,6,17,9],[18,1,18,4],[18,6,18,9],[19,1,19,4],[19,6,19,9],[22,1,22,4],[23,1,23,4],[24,1,24,4],[33,8,33,9],[34,7,34,8],[55,2,55,9],[38,8,38,10],[39,8,39,10],[40,8,40,10],[44,2,44,9],[45,2,45,9],[46,2,46,9],[47,2,47,9],[48,2,48,9],[52,2,52,9],[53,2,53,9],[54,2,54,9],[56,2,56,9],[57,2,57,9],[58,2,58,9],[59,2,59,9],[60,2,60,4],[60,6,60,7],[60,8,60,9],[73,1,73,9],[74,1,74,9],[64,1,64,9],[68,1,68,9],[69,1,69,9],[70,1,70,9],[71,1,71,9],[72,1,72,9]]}
["       < Add your School's logo here >"]
["Termly Support Meeting - School Attendance - 2023/24 Term 3"]
[]
[null,"School - ","Click in cell and use drop-down arrow on right to select school",null,null,null,null,null,null,{"$f":"IF(C4=\"Click in cell and use drop-down arrow on right to select school\",\"\",VLOOKUP(C4,'School List'!A4:B391,2,FALSE))","v":""}]
[null,"Name of school's SLT Lead - ",null,null,null,null,null,"Present at the meeting - ",null,"Select"]
[null,"Name of LCC's Lead - "]
[null,"Other attendees - "]
[null,"School email address(s) for template - "]
[]
[null,"Date of Meeting - ",null,null,"  DD/MM/YYYY",null,{"$f":"IF(C4=\"Click in cell and use drop-down arrow on right to select school\",\"\",\"Phase - \")","v":""},{"$f":"IF(C4=\"Click in cell and use drop-down arrow on right to select school\",\"\",VLOOKUP(C4,'School List'!A:K,6,FALSE))","v":""}]
[null,null,null,null,null,null,{"$f":"IF(C4=\"Click in cell and use drop-down arrow on right to select school\",\"\",\"Type - \")","v":""},{"$f":"IF(C4=\"Click in cell and use drop-down arrow on right to select school\",\"\",VLOOKUP(C4,'School List'!A:K,10,FALSE))","v":""}]
["Priorities - common priorities can be copied from right to left"]
[null,"School",null,null,null,null,"LCC"]
["1. ",null,null,null,null,"1. ","Authorised absence - this is higher than national average and they are at risk of persistent absence."]
["2. ",null,null,null,null,"2. ","Persistent Absence (PA)"]
["3. ",null,null,null,null,"3. ","Special schools"]
["4. ",null,null,null,null,"4. ","Children with Education Health & Care Plans"]
["5. ",null,null,null,null,"5. ","Children with a social worker"]
["6. ",null,null,null,null,"6. ","Children with anxiety/school phobia"]
["7. ",null,null,null,null,"7. ","Children known to the youth offending service/Futures 4 Me"]
[]
["Policies, processes and documents"]
[null,"Is there a clear attendance policy on the school's website?",null,null,null,"Select"]
[null,"Has the school signed up to sharing data with the DfE?",null,null,null,"Select"]
[null,"Are there robust daily processes for following up absence?",null,null,null,"Select"]
[]
["Key data"]
[null,"School's current % attendance - only add numbers in cells not a % sign"]
[]
[null,"School Profile","Severe","At risk of severe","PA","At risk of PA","Expected"]
[null,"Group","0-50%","51-79%","80-90%","91-94%","95-100%","Total"]
[null,"No of children in each band ",null,null,null,null,null,{"$f":"SUM(C32:G32)","v":0},"Overall %"]
[null,"% ",{"$f":"IF(C32=\"\",\"\",C32/$H$32)","v":""},{"$f":"IF(D32=\"\",\"\",D32/$H$32)","v":""},"","",""]
[null,"**  Select Phase  **",{"$f":"IF($B$34=\"**  Select Phase  **\",\" - \",VLOOKUP($B$34,LookUps!$C$5:$N$9,4,FALSE))","v":" - "},{"$f":"IF($B$34=\"**  Select Phase  **\",\" - \",VLOOKUP($B$34,LookUps!$C$5:$N$9,6,FALSE))","v":" - "},{"$f":"IF($B$34=\"**  Select Phase  **\",\" - \",VLOOKUP($B$34,LookUps!$C$5:$N$9,8,FALSE))","v":" - "},{"$f":"IF($B$34=\"**  Select Phase  **\",\" - \",VLOOKUP($B$34,LookUps!$C$5:$N$9,10,FALSE))","v":" - "},{"$f":"IF($B$34=\"**  Select Phase  **\",\" - \",VLOOKUP($B$34,LookUps!$C$5:$N$9,12,FALSE))","v":" - "},null,{"$f":"IF(I33>=95,\"Expected attendance rate\",IF(I33>=91,\"At risk of persistent absence\",(IF(I33>=80,\"Persistent absence\",IF(I33>=51,\"At risk of severe absence\",IF(I33>0,\"Severe absence\",\"\"))))))","v":""}]
[null,"Difference ",{"$f":"IF(C32=\"\",\" - \",C33-C34)","v":" - "},{"$f":"IF(D32=\"\",\" - \",D33-D34)","v":" - "},{"$f":"IF(E32=\"\",\" - \",E33-E34)","v":" - "},{"$f":"IF(F32=\"\",\" - \",F33-F34)","v":" - "},{"$f":"IF(G32=\"\",\" - \",G33-G34)","v":" - "},{"$f":"IF(H32>0,\"  One child is equal to \"&ROUND(((1/H32)*100),1)&\" %\",\"\")","v":""}]
[]
[null,"School's historical % attendance - school census"]
[null,null,null,null,null,null,null,"Overall %"]
[null,"Spring 2023",{"$f":"IF(J4=\"\",\"\",VLOOKUP($J$4,LookUps!$AL$16:$AZ$368,5,FALSE))","v":""},{"$f":"IF(J4=\"\",\"\",VLOOKUP($J$4,LookUps!$AL$16:$AZ$368,7,FALSE))","v":""},{"$f":"IF(J4=\"\",\"\",VLOOKUP($J$4,LookUps!$AL$16:$AZ$368,9,FALSE))","v":""},{"$f":"IF(J4=\"\",\"\",VLOOKUP($J$4,LookUps!$AL$16:$AZ$368,11,FALSE))","v":""},{"$f":"IF(J4=\"\",\"\",VLOOKUP($J$4,LookUps!$AL$16:$AZ$368,13,FALSE))","v":""},{"$f":"IF(J4=\"\",\"\",VLOOKUP($J$4,LookUps!$AL$16:$AZ$368,14,FALSE))","v":""},{"$f":"IF(J4=\"\",\"\",\"  \"&VLOOKUP($J$4,LookUps!$AL$16:$AZ$368,15,FALSE))","v":""}]
[null,"Autumn 2022",{"$f":"IF(J4=\"\",\"\",VLOOKUP($J$4,LookUps!$U$16:$AI$368,5,FALSE))","v":""},{"$f":"IF(J4=\"\",\"\",VLOOKUP($J$4,LookUps!$U$16:$AI$368,7,FALSE))","v":""},{"$f":"IF(J4=\"\",\"\",VLOOKUP($J$4,LookUps!$U$16:$AI$368,9,FALSE))","v":""},{"$f":"IF(J4=\"\",\"\",VLOOKUP($J$4,LookUps!$U$16:$AI$368,11,FALSE))","v":""},{"$f":"IF(J4=\"\",\"\",VLOOKUP($J$4,LookUps!$U$16:$AI$368,13,FALSE))","v":""},{"$f":"IF(J4=\"\",\"\",VLOOKUP($J$4,LookUps!$U$16:$AI$368,14,FALSE))","v":""},{"$f":"IF(J4=\"\",\"\",\"  \"&VLOOKUP($J$4,LookUps!$U$16:$AI$368,15,FALSE))","v":""}]
[null,"Summer 2022",{"$f":"IF(J4=\"\",\"\",VLOOKUP($J$4,LookUps!$D$16:$R$368,5,FALSE))","v":""},{"$f":"IF(J4=\"\",\"\",VLOOKUP($J$4,LookUps!$D$16:$R$368,7,FALSE))","v":""},{"$f":"IF(J4=\"\",\"\",VLOOKUP($J$4,LookUps!$D$16:$R$368,9,FALSE))","v":""},{"$f":"IF(J4=\"\",\"\",VLOOKUP($J$4,LookUps!$D$16:$R$368,11,FALSE))","v":""},{"$f":"IF(J4=\"\",\"\",VLOOKUP($J$4,LookUps!$D$16:$R$368,13,FALSE))","v":""},{"$f":"IF(J4=\"\",\"\",VLOOKUP($J$4,LookUps!$D$16:$R$368,14,FALSE))","v":""},{"$f":"IF(J4=\"\",\"\",\"  \"&VLOOKUP($J$4,LookUps!$D$16:$R$368,15,FALSE))","v":""}]
[]
["Discussion points"]
[]
[null,"Expected\n100-95%","* \n* \n* \n* \n* \n"]
[null,"At risk of persistent absence\n94-91%","* \n* \n* \n* \n* \n"]
[null,"Persistent absence\n90-80%","* \n* \n* \n* \n* \n"]
[null,"At risk of severe absence\n79-51%","* \n* \n* \n* \n* \n"]
[null,"Severe absence\n50-0%","* \n* \n* \n* \n* \n"]
[]
["Groups of children"]
[]
[null,"Children with an Education, health & care plan","* \n* \n* \n* \n* \n"]
[null,"Children with a social worker","* \n* \n* \n* \n* \n"]
[null,"Children anxiety/school phobia","* \n* \n* \n* \n* \n"]
[null,"Children known to youth offending service/Futures4Me","* \n* \n* \n* \n* \n"]
[null,"Children eligible for FSM","* \n* \n* \n* \n* \n"]
[null,"Gender","* \n* \n* \n* \n* \n"]
[null,"Ethnicity","* \n* \n* \n* \n* \n"]
[null,"Other(s) e.g. pupil leavers and joiners/ EHE / CME","* \n* \n* \n* \n* \n"]
[null,"Number of children in an alternative provision setting",null,null,null,null,"Number of children on a reduced timetable"]
[]
["What's working well for the school?"]
[]
[null,"* \n* \n* \n* \n* \n"]
[]
["School's Action points"]
[]
["1. "]
["2. "]
["3. "]
["4. "]
["5. "]
["6. "]
["7. "]

{"sheet":"LookUps","index":4,"n_rows":368,"n_cols":52,"rows_kept":368,"cut":false,"hidden":true,"merged":[[10,2,10,15],[11,6,11,16],[12,4,14,4],[12,5,14,5],[12,6,12,7],[12,12,12,13],[12,2,14,2],[13,11,14,11],[13,12,14,12],[13,6,14,6],[13,7,14,7],[13,8,14,8],[13,9,14,9],[12,3,14,3],[13,10,14,10],[12,8,12,9],[12,10,12,11],[12,14,12,15],[12,16,14,16],[12,17,14,17],[13,13,14,13],[13,14,14,14],[13,15,14,15],[10,19,10,33],[11,23,11,33],[11,40,11,50],[12,19,14,19],[12,20,14,20],[12,21,14,21],[12,22,14,22],[12,23,12,24],[12,25,12,26],[12,27,12,28],[12,29,12,30],[12,31,12,32],[12,33,14,33],[12,36,14,36],[12,37,14,37],[12,38,14,38],[12,44,12,45],[12,46,12,47],[13,44,14,44],[13,45,14,45],[13,46,14,46],[13,47,14,47],[13,32,14,32],[13,40,14,40],[13,41,14,41],[13,42,14,42],[13,43,14,43],[12,39,14,39],[12,40,12,41],[12,42,12,43],[13,48,14,48],[13,49,14,49],[12,34,14,34],[12,51,14,51],[1,15,8,15],[12,48,12,49],[12,50,14,50],[13,23,14,23],[13,24,14,24],[13,25,14,25],[13,26,14,26],[13,27,14,27],[13,28,14,28],[13,29,14,29],[13,30,14,30],[13,31,14,31]]}
["Q Lookup",null,"Aut 21 - Sum 22"]
["Select",null,null,"Number of Enrolments","Attendance Thresholds",null,null,null,null,null,null,null,null,null,null,"The table left is the most recent complete year of data"]
["Yes",null,null,null,"0-50%",null,"51-79%",null,"80-90%",null,"91-94%",null,"95-100%"]
["No",null,"**  Select Phase  **",null,"Count","%","Count","%","Count","%","Count","%","Count","%"]
[null,null,"All Lincs PRI Schools",153607,1059,6.8942170604204232E-3,7718,5.0245106017303899E-2,30590,0.19914457023442941,26622,0.17331241414779275,87537,0.56987637282155112]
[null,null,"All Lincs SEC Schools",116442,3162,2.7155150203534806E-2,9268,7.9593273904604869E-2,25423,0.21833187337902132,20860,0.17914498205114993,57632,0.49494168770718472]
[null,null,"All Lincs SP Schools",4562,246,5.3923717667689608E-2,550,0.12056115738711091,927,0.20320035072336695,706,0.15475668566418238,2109,0.46229723805348533]
[null,null,"All-Through School",3735,224,5.9973226238286478E-2,408,0.10923694779116466,806,0.21579651941097724,626,0.16760374832663991,1664,0.44551539491298525]
[null,null,"All Schools in Lincs",278346,4691,1.6853125246994748E-2,17944,6.4466527271812776E-2,57746,0.20746121733382195,48814,0.17537165973285049,148942,0.53509660638198497]
[]
[null,null,"Summer 2022",null,null,null,null,null,null,null,null,null,null,null,null,null,null,null,null,"Autumn 2022",null,null,null,null,null,null,null,null,null,null,null,null,null,null,null,null,"Spring 2023"]
[null,null,null,null,null,null,"Attendance Thresholds",null,null,null,null,null,null,null,null,null,null,null,null,null,null,null,null,"Attendance Thresholds",null,null,null,null,null,null,null,null,null,null,null,null,null,null,null,null,"Attendance Thresholds"]
[null,null,"Phase","DfE No","School","Number of Enrolments","0-50%",null,"51-79%",null,"80-90%",null,"91-94%",null,"95-100%",null,"Overall Attendance %","Description",null,"Phase","DfE No","School","Number of Enrolments","0-50%",null,"51-79%",null,"80-90%",null,"91-94%",null,"95-100%",null,"Overall Attendance %","Description",null,"Phase","DfE No","School","Number of Enrolments","0-50%",null,"51-79%",null,"80-90%",null,"91-94%",null,"95-100%",null,"Overall Attendance %","Description"]
[null,null,null,null,null,null,"Count","%","Count","%","Count","%","Count","%","Count","%",null,null,null,null,null,null,null,"Count","%","Count","%","Count","%","Count","%","Count","%",null,null,null,null,null,null,null,"Count","%","Count","%","Count","%","Count","%","Count","%"]
[]
[null,null,"All-Through",9256905,"The Priory Witham Academy",859,31,3.6088474970896393E-2,99,0.11525029103608847,126,0.14668218859138532,128,0.1490104772991851,475,0.55296856810244466,0.90222445645343718,"Persistent absence",null,"Primary",9252000,"Skegness Junior Academy",319,0,0,26,8.1504702194357362E-2,74,0.23197492163009403,61,0.19122257053291536,158,0.4952978056426332,0.92327519753324339,"At risk of persistent absence",{"$f":"AL16*1","v":9252000},"Primary",9252000,"Skegness Junior Academy",322,1,3.105590062111801E-3,17,5.2795031055900624E-2,57,0.17701863354037267,58,0.18012422360248448,189,0.58695652173913049,0.94325748054656788,"At risk of persistent absence"]
[null,null,"Primary",9252000,"Skegness Junior Academy",343,6,1.7492711370262391E-2,26,7.5801749271137031E-2,44,0.1282798833819242,48,0.13994169096209913,219,0.63848396501457727,0.93524727577535627,"At risk of persistent absence",null,"Primary",9252002,"Bassingham Primary School",167,1,5.9880239520958087E-3,5,2.9940119760479042E-2,35,0.20958083832335328,34,0.20359281437125748,92,0.55089820359281438,0.93976288189694479,"At risk of persistent absence",{"$f":"AL17*1","v":9252002},"Primary",9252002,"Bassingham Primary School",163,2,1.2269938650306749E-2,4,2.4539877300613498E-2,29,0.17791411042944785,30,0.18404907975460122,98,0.60122699386503065,0.94358669833729214,"At risk of persistent absence"]
[null,null,"Primary",9252002,"Bassingham Primary School",198,1,5.0505050505050509E-3,5,2.5252525252525252E-2,19,9.5959595959595953E-2,20,0.10101010101010101,153,0.77272727272727271,0.96735459662288925,"As expected",null,"Primary",9252003,"Billingborough Primary School",117,1,8.5470085470085479E-3,7,5.9829059829059832E-2,16,0.13675213675213677,25,0.21367521367521367,68,0.58119658119658124,0.93573166047881196,"At risk of persistent absence",9252003,"Primary",9252003,"Billingborough Primary School",119,1,8.4033613445378148E-3,7,5.8823529411764705E-2,25,0.21008403361344538,28,0.23529411764705882,58,0.48739495798319327,0.92791478184736609,"At risk of persistent absence"]
[null,null,"Primary",9252003,"Billingborough Primary School",130,1,7.6923076923076927E-3,8,6.1538461538461542E-2,8,6.1538461538461542E-2,25,0.19230769230769232,88,0.67692307692307696,0.94954632939235639,"At risk of persistent absence",null,"Primary",9252004,"Ingoldmells Academy",101,1,9.9009900990099011E-3,13,0.12871287128712872,32,0.31683168316831684,17,0.16831683168316833,38,0.37623762376237624,0.90342753106942131,"Persistent absence",9252004,"Primary",9252004,"Ingoldmells Academy",98,1,1.020408163265306E-2,8,8.1632653061224483E-2,13,0.1326530612244898,23,0.23469387755102042,53,0.54081632653061229,0.93274800868935559,"At risk of persistent absence"]
[null,null,"Primary",9252004,"Ingoldmells Academy",120,0,0,9,7.4999999999999997E-2,18,0.15,17,0.14166666666666666,76,0.6333333333333333,0.94097378277153554,"At risk of persistent absence",null,"Primary",9252005,"Mablethorpe Primary Academy",293,4,1.3651877133105802E-2,21,7.1672354948805458E-2,85,0.29010238907849828,75,0.25597269624573377,108,0.36860068259385664,0.90629609502367825,"Persistent absence",9252005,"Primary",9252005,"Mablethorpe Primary Academy",292,3,1.0273972602739725E-2,27,9.2465753424657529E-2,68,0.23287671232876711,69,0.2363013698630137,125,0.42808219178082191,0.91254741313912913,"At risk of persistent absence"]
[null,null,"Primary",9252005,"Mablethorpe Primary Academy",310,4,1.2903225806451613E-2,23,7.4193548387096769E-2,47,0.15161290322580645,29,9.3548387096774197E-2,207,0.66774193548387095,0.93909756390255605,"At risk of persistent absence",null,"Primary",9252006,"Lincoln Carlton Academy",363,0,0,12,3.3057851239669422E-2,45,0.12396694214876033,68,0.18732782369146006,238,0.65564738292011016,0.95232709144987637,"As expected",9252006,"Primary",9252006,"Lincoln Carlton Academy",361,1,2.7700831024930748E-3,4,1.1080332409972299E-2,21,5.817174515235457E-2,62,0.17174515235457063,273,0.75623268698060941,0.96724645309471968,"As expected"]
[null,null,"Primary",9252006,"Lincoln Carlton Academy",420,2,4.7619047619047623E-3,27,6.4285714285714279E-2,48,0.11428571428571428,44,0.10476190476190476,299,0.71190476190476193,0.94905928292509767,"At risk of persistent absence",null,"Primary",9252007,"Fishtoft Academy",46,0,0,1,2.1739130434782608E-2,9,0.19565217391304349,11,0.2391304347826087,25,0.54347826086956519,0.93994149027706075,"At risk of persistent absence",9252007,"Primary",9252007,"Fishtoft Academy",51,0,0,0,0,8,0.15686274509803921,11,0.21568627450980393,32,0.62745098039215685,0.95656817372730507,"As expected"]
[null,null,"Primary",9252007,"Fishtoft Academy",51,3,5.8823529411764705E-2,4,7.8431372549019607E-2,5,9.8039215686274508E-2,5,9.8039215686274508E-2,34,0.66666666666666663,0.89007092198581561,"Persistent absence",null,"Primary",9252008,"Gainsborough Mercer's Wood Academy",160,1,6.2500000000000003E-3,10,6.25E-2,38,0.23749999999999999,36,0.22500000000000001,75,0.46875,0.92455968688845402,"At risk of persistent absence",9252008,"Primary",9252008,"Gainsborough Mercer's Wood Academy",153,5,3.2679738562091505E-2,8,5.2287581699346407E-2,29,0.18954248366013071,34,0.22222222222222221,77,0.50326797385620914,0.92868315856555239,"At risk of persistent absence"]
[null,null,"Primary",9252008,"Gainsborough Mercer's Wood Academy",182,12,6.5934065934065936E-2,16,8.7912087912087919E-2,26,0.14285714285714285,17,9.3406593406593408E-2,111,0.60989010989010994,0.91175231676495372,"At risk of persistent absence",null,"Primary",9252009,"St John's Primary Academy",341,0,0,6,1.7595307917888565E-2,53,0.15542521994134897,67,0.19648093841642228,215,0.63049853372434017,0.94944069602272729,"At risk of persistent absence",9252009,"Primary",9252009,"St John's Primary Academy",341,0,0,7,2.0527859237536656E-2,59,0.17302052785923755,63,0.18475073313782991,212,0.6217008797653959,0.95151562016702751,"As expected"]
[null,null,"Primary",9252009,"St John's Primary Academy",402,0,0,29,7.2139303482587069E-2,66,0.16417910447761194,53,0.13184079601990051,254,0.63184079601990051,0.94458333333333333,"At risk of persistent absence",null,"Primary",9252010,"Boston Pioneers Free School Academy",367,13,3.5422343324250684E-2,27,7.3569482288828342E-2,85,0.23160762942779292,66,0.17983651226158037,176,0.47956403269754766,0.91064545047064094,"At risk of persistent absence",9252010,"Primary",9252010,"Boston Pioneers Free School Academy",363,4,1.1019283746556474E-2,17,4.6831955922865015E-2,62,0.17079889807162535,80,0.22038567493112948,200,0.55096418732782371,0.94145210376310318,"At risk of persistent absence"]
[null,null,"Primary",9252010,"Boston Pioneers Free School Academy",410,7,1.7073170731707318E-2,28,6.8292682926829273E-2,97,0.23658536585365852,56,0.13658536585365855,222,0.54146341463414638,0.92516049599859296,"At risk of persistent absence",null,"Primary",9252012,"Caythorpe Primary School",84,4,4.7619047619047616E-2,8,9.5238095238095233E-2,14,0.16666666666666666,12,0.14285714285714285,46,0.54761904761904767,0.91465919701213816,"At risk of persistent absence",9252012,"Primary",9252012,"Caythorpe Primary School",77,0,0,7,9.0909090909090912E-2,4,5.1948051948051951E-2,19,0.24675324675324675,47,0.61038961038961037,0.94108170310701955,"At risk of persistent absence"]
[null,null,"Primary",9252012,"Caythorpe Primary School",107,3,2.8037383177570093E-2,11,0.10280373831775701,15,0.14018691588785046,11,0.10280373831775701,67,0.62616822429906538,0.91160996141704664,"At risk of persistent absence",null,"Primary",9252013,"Corby Glen Community Primary School",62,0,0,6,9.6774193548387094E-2,7,0.11290322580645161,12,0.19354838709677419,37,0.59677419354838712,0.94979188345473464,"At risk of persistent absence",9252013,"Primary",9252013,"Corby Glen Community Primary School",59,0,0,0,0,4,6.7796610169491525E-2,7,0.11864406779661017,48,0.81355932203389836,0.9743279975838115,"As expected"]
[null,null,"Primary",9252013,"Corby Glen Community Primary School",77,0,0,2,2.5974025974025976E-2,9,0.11688311688311688,15,0.19480519480519481,51,0.66233766233766234,0.9583914458391446,"As expected",null,"Primary",9252014,"Beacon Primary Academy",179,0,0,12,6.7039106145251395E-2,26,0.14525139664804471,28,0.15642458100558659,113,0.63128491620111726,0.94380243109056672,"At risk of persistent absence",9252014,"Primary",9252014,"Beacon Primary Academy",180,0,0,4,2.2222222222222223E-2,22,0.12222222222222222,26,0.14444444444444443,128,0.71111111111111114,0.96032538889681751,"As expected"]
[null,null,"Primary",9252014,"Beacon Primary Academy",211,2,9.4786729857819912E-3,18,8.5308056872037921E-2,33,0.15639810426540285,25,0.11848341232227488,133,0.63033175355450233,0.93205782312925167,"At risk of persistent absence",null,"Primary",9252015,"The Wainfleet Magdalen Church of England Methodist School",165,4,2.4242424242424242E-2,28,0.16969696969696971,58,0.3515151515151515,21,0.12727272727272726,54,0.32727272727272727,0.87928643168013776,"Persistent absence",9252015,"Primary",9252015,"The Wainfleet Magdalen Church of England Methodist School",163,1,6.1349693251533744E-3,13,7.9754601226993863E-2,41,0.25153374233128833,39,0.2392638036809816,69,0.42331288343558282,0.91873373346789189,"At risk of persistent absence"]
[null,null,"Primary",9252015,"The Wainfleet Magdalen Church of England Methodist School",181,1,5.5248618784530384E-3,28,0.15469613259668508,50,0.27624309392265195,20,0.11049723756906077,82,0.45303867403314918,0.90352409329086614,"Persistent absence",null,"Primary",9252016,"Bourne Elsea Park C of E Primary Academy",243,2,8.23045267489712E-3,5,2.0576131687242798E-2,44,0.18106995884773663,55,0.22633744855967078,137,0.56378600823045266,0.9434779897742861,"At risk of persistent absence",9252016,"Primary",9252016,"Bourne Elsea Park C of E Primary Academy",248,3,1.2096774193548387E-2,5,2.0161290322580645E-2,30,0.12096774193548387,44,0.17741935483870969,166,0.66935483870967738,0.95331538679512606,"As expected"]
[null,null,"Primary",9252016,"Bourne Elsea Park C of E Primary Academy",296,0,0,17,5.7432432432432436E-2,46,0.1554054054054054,28,9.45945945945946E-2,205,0.69256756756756754,0.94813095835423988,"At risk of persistent absence",null,"Primary",9252017,"Tedder County Primary School",96,0,0,0,0,8,8.3333333333333329E-2,13,0.13541666666666666,75,0.78125,0.96996235063021774,"As expected",9252017,"Primary",9252017,"Tedder County Primary School",95,1,1.0526315789473684E-2,1,1.0526315789473684E-2,6,6.3157894736842107E-2,15,0.15789473684210525,72,0.75789473684210529,0.96571704490584254,"As expected"]
[null,null,"Primary",9252017,"Tedder County Primary School",114,0,0,2,1.7543859649122806E-2,11,9.6491228070175433E-2,7,6.1403508771929821E-2,94,0.82456140350877194,0.9728455284552846,"As expected",null,"Primary",9252018,"Castle Wood Academy",250,1,4.0000000000000001E-3,4,1.6E-2,42,0.16800000000000001,61,0.24399999999999999,142,0.56799999999999995,0.94886942961674559,"At risk of persistent absence",9252018,"Primary",9252018,"Castle Wood Academy",248,3,1.2096774193548387E-2,9,3.6290322580645164E-2,23,9.2741935483870969E-2,50,0.20161290322580644,163,0.657258064516129,0.95269197459584298,"As expected"]
[null,null,"Primary",9252018,"Castle Wood Academy",301,4,1.3289036544850499E-2,8,2.6578073089700997E-2,45,0.14950166112956811,26,8.6378737541528236E-2,218,0.72425249169435213,0.95271779597915118,"As expected",null,"Primary",9252019,"Eagle Community Primary School",64,0,0,0,0,10,0.15625,11,0.171875,43,0.671875,0.95695211786372003,"As expected",9252019,"Primary",9252019,"Eagle Community Primary School",66,0,0,1,1.5151515151515152E-2,6,9.0909090909090912E-2,13,0.19696969696969696,46,0.69696969696969702,0.960833775889538,"As expected"]
[null,null,"Primary",9252019,"Eagle Community Primary School",73,0,0,5,6.8493150684931503E-2,8,0.1095890410958904,6,8.2191780821917804E-2,54,0.73972602739726023,0.94989775051124747,"At risk of persistent absence",null,"Primary",9252020,"Huntingtower Community Primary Academy",363,1,2.7548209366391185E-3,7,1.928374655647383E-2,80,0.22038567493112948,66,0.18181818181818182,209,0.5757575757575758,0.94130898266221485,"At risk of persistent absence",9252020,"Primary",9252020,"Huntingtower Community Primary Academy",364,1,2.7472527472527475E-3,5,1.3736263736263736E-2,60,0.16483516483516483,84,0.23076923076923078,214,0.58791208791208793,0.94883407207554438,"At risk of persistent absence"]
[null,null,"Primary",9252020,"Huntingtower Community Primary Academy",419,3,7.1599045346062056E-3,23,5.4892601431980909E-2,49,0.11694510739856802,66,0.15751789976133651,278,0.66348448687350836,0.94642704321780058,"At risk of persistent absence",null,"Primary",9252021,"Wygate Park Academy",219,1,4.5662100456621002E-3,6,2.7397260273972601E-2,45,0.20547945205479451,42,0.19178082191780821,125,0.57077625570776258,0.94409066378845119,"At risk of persistent absence",9252021,"Primary",9252021,"Wygate Park Academy",217,0,0,2,9.2165898617511521E-3,36,0.16589861751152074,52,0.23963133640552994,127,0.58525345622119818,0.95209916033586561,"As expected"]
[null,null,"Primary",9252021,"Wygate Park Academy",238,1,4.2016806722689074E-3,6,2.5210084033613446E-2,32,0.13445378151260504,32,0.13445378151260504,167,0.70168067226890751,0.95730421686746991,"As expected",null,"Primary",9252023,"Weston St Mary Church of England Primary School",41,0,0,2,4.878048780487805E-2,9,0.21951219512195122,8,0.1951219512195122,22,0.53658536585365857,0.93383369543748762,"At risk of persistent absence",9252023,"Primary",9252023,"Weston St Mary Church of England Primary School",35,2,5.7142857142857141E-2,0,0,1,2.8571428571428571E-2,10,0.2857142857142857,22,0.62857142857142856,0.9239021956087824,"At risk of persistent absence"]
[null,null,"Primary",9252023,"Weston St Mary Church of England Primary School",49,0,0,4,8.1632653061224483E-2,14,0.2857142857142857,6,0.12244897959183673,25,0.51020408163265307,0.92227378190255216,"At risk of persistent absence",null,"Primary",9252024,"The Isaac Newton Primary School",356,4,1.1235955056179775E-2,13,3.6516853932584269E-2,58,0.16292134831460675,47,0.13202247191011235,234,0.65730337078651691,0.94401313825022393,"At risk of persistent absence",9252024,"Primary",9252024,"The Isaac Newton Primary School",352,3,8.5227272727272721E-3,7,1.9886363636363636E-2,56,0.15909090909090909,93,0.26420454545454547,193,0.54829545454545459,0.94224341329138817,"At risk of persistent absence"]
[null,null,"Primary",9252024,"The Isaac Newton Primary School",411,2,4.8661800486618006E-3,17,4.1362530413625302E-2,39,9.4890510948905105E-2,55,0.13381995133819952,298,0.72506082725060828,0.95657682058450921,"As expected",null,"Primary",9252025,"Helpringham School",82,1,1.2195121951219513E-2,8,9.7560975609756101E-2,15,0.18292682926829268,27,0.32926829268292684,31,0.37804878048780488,0.9081110705151626,"Persistent absence",9252025,"Primary",9252025,"Helpringham School",81,0,0,3,3.7037037037037035E-2,17,0.20987654320987653,15,0.18518518518518517,46,0.5679012345679012,0.93754024468770125,"At risk of persistent absence"]
[null,null,"Primary",9252025,"Helpringham School",101,0,0,6,5.9405940594059403E-2,12,0.11881188118811881,10,9.9009900990099015E-2,73,0.72277227722772275,0.95538009548292324,"As expected",null,"Primary",9252028,"Langtoft Primary School",176,0,0,3,1.7045454545454544E-2,18,0.10227272727272728,35,0.19886363636363635,120,0.68181818181818177,0.95521884100789267,"As expected",9252028,"Primary",9252028,"Langtoft Primary School",176,0,0,3,1.7045454545454544E-2,14,7.9545454545454544E-2,24,0.13636363636363635,135,0.76704545454545459,0.96587301587301588,"As expected"]
[null,null,"Primary",9252028,"Langtoft Primary School",189,0,0,8,4.2328042328042326E-2,16,8.4656084656084651E-2,18,9.5238095238095233E-2,147,0.77777777777777779,0.96208112874779539,"As expected",null,"Primary",9252030,"The Metheringham Primary School",229,0,0,2,8.7336244541484712E-3,42,0.18340611353711792,45,0.1965065502183406,140,0.611353711790393,0.95143822424299829,"As expected",9252030,"Primary",9252030,"The Metheringham Primary School",230,1,4.3478260869565218E-3,8,3.4782608695652174E-2,40,0.17391304347826086,40,0.17391304347826086,141,0.61304347826086958,0.95001715658240882,"As expected"]
[null,null,"Primary",9252030,"The Metheringham Primary School",265,1,3.7735849056603774E-3,9,3.3962264150943396E-2,42,0.15849056603773584,19,7.1698113207547168E-2,194,0.73207547169811316,0.95134228187919467,"As expected",null,"Primary",9252031,"Nocton Community Primary School",26,0,0,1,3.8461538461538464E-2,4,0.15384615384615385,2,7.6923076923076927E-2,19,0.73076923076923073,0.95427728613569318,"As expected",9252031,"Primary",9252031,"Nocton Community Primary School",25,0,0,0,0,1,0.04,8,0.32,16,0.64,0.96943078004216443,"As expected"]
[null,null,"Primary",9252031,"Nocton Community Primary School",34,0,0,2,5.8823529411764705E-2,10,0.29411764705882354,4,0.11764705882352941,18,0.52941176470588236,0.92942515651679003,"At risk of persistent absence",null,"Primary",9252033,"North Scarle Primary School",50,0,0,0,0,13,0.26,10,0.2,27,0.54,0.9458039333433419,"At risk of persistent absence",9252033,"Primary",9252033,"North Scarle Primary School",50,0,0,0,0,8,0.16,7,0.14000000000000001,35,0.7,0.96172413793103451,"As expected"]
[null,null,"Primary",9252033,"North Scarle Primary School",55,0,0,4,7.2727272727272724E-2,11,0.2,7,0.12727272727272726,33,0.6,0.94187627464309998,"At risk of persistent absence",null,"Primary",9252034,"OSBOURNBY PRIMARY SCHOOL",68,3,4.4117647058823532E-2,2,2.9411764705882353E-2,11,0.16176470588235295,9,0.13235294117647059,43,0.63235294117647056,0.92110475352112675,"At risk of persistent absence",9252034,"Primary",9252034,"OSBOURNBY PRIMARY SCHOOL",68,4,5.8823529411764705E-2,4,5.8823529411764705E-2,6,8.8235294117647065E-2,11,0.16176470588235295,43,0.63235294117647056,0.90123929985946083,"Persistent absence"]
[null,null,"Primary",9252034,"OSBOURNBY PRIMARY SCHOOL",73,1,1.3698630136986301E-2,3,4.1095890410958902E-2,10,0.13698630136986301,8,0.1095890410958904,51,0.69863013698630139,0.95256509409641665,"As expected",null,"Primary",9252035,"Ingoldsby Academy",54,0,0,1,1.8518518518518517E-2,4,7.407407407407407E-2,9,0.16666666666666666,40,0.7407407407407407,0.96102449888641428,"As expected",9252035,"Primary",9252035,"Ingoldsby Academy",58,0,0,0,0,12,0.20689655172413793,12,0.20689655172413793,34,0.58620689655172409,0.94466831990080591,"At risk of persistent absence"]
[null,null,"Primary",9252035,"Ingoldsby Academy",54,0,0,2,3.7037037037037035E-2,6,0.1111111111111111,2,3.7037037037037035E-2,44,0.81481481481481477,0.9638795986622074,"As expected",null,"Primary",9252036,"Manor Farm Academy",180,0,0,3,1.6666666666666666E-2,15,8.3333333333333329E-2,34,0.18888888888888888,128,0.71111111111111114,0.9614502253174928,"As expected",9252036,"Primary",9252036,"Manor Farm Academy",182,0,0,3,1.6483516483516484E-2,15,8.2417582417582416E-2,17,9.3406593406593408E-2,147,0.80769230769230771,0.96886882129277563,"As expected"]
[null,null,"Primary",9252036,"Manor Farm Academy",180,0,0,13,7.2222222222222215E-2,27,0.15,12,6.6666666666666666E-2,128,0.71111111111111114,0.94959802102659241,"At risk of persistent absence",null,"Primary",9252038,"Sleaford Church Lane Primary School",176,0,0,1,5.681818181818182E-3,15,8.5227272727272721E-2,45,0.25568181818181818,115,0.65340909090909094,0.96068398495582963,"As expected",9252038,"Primary",9252038,"Sleaford Church Lane Primary School",180,1,5.5555555555555558E-3,2,1.1111111111111112E-2,24,0.13333333333333333,43,0.2388888888888889,110,0.61111111111111116,0.95624089363768816,"As expected"]
[null,null,"Primary",9252038,"Sleaford Church Lane Primary School",210,1,4.7619047619047623E-3,13,6.1904761904761907E-2,18,8.5714285714285715E-2,15,7.1428571428571425E-2,163,0.77619047619047621,0.96127826241766068,"As expected",null,"Primary",9252039,"South Hykeham School",125,1,8.0000000000000002E-3,2,1.6E-2,14,0.112,24,0.192,84,0.67200000000000004,0.9468764789398959,"At risk of persistent absence",9252039,"Primary",9252039,"South Hykeham School",124,1,8.0645161290322578E-3,3,2.4193548387096774E-2,19,0.15322580645161291,23,0.18548387096774194,78,0.62903225806451613,0.94962869553033491,"At risk of persistent absence"]
[null,null,"Primary",9252039,"South Hykeham School",156,1,6.41025641025641E-3,10,6.4102564102564097E-2,20,0.12820512820512819,12,7.6923076923076927E-2,113,0.72435897435897434,0.94836632482709282,"At risk of persistent absence",null,"Primary",9252040,"Theddlethorpe Academy",75,0,0,3,0.04,11,0.14666666666666667,12,0.16,49,0.65333333333333332,0.94991823385118557,"At risk of persistent absence",9252040,"Primary",9252040,"Theddlethorpe Academy",78,1,1.282051282051282E-2,2,2.564102564102564E-2,15,0.19230769230769232,14,0.17948717948717949,46,0.58974358974358976,0.94575847168523997,"At risk of persistent absence"]
[null,null,"Primary",9252040,"Theddlethorpe Academy",89,0,0,4,4.49438202247191E-2,13,0.14606741573033707,4,4.49438202247191E-2,68,0.7640449438202247,0.95841995841995842,"As expected",null,"Primary",9252042,"South Witham Academy",78,0,0,6,7.6923076923076927E-2,16,0.20512820512820512,13,0.16666666666666666,43,0.55128205128205132,0.93508753967441383,"At risk of persistent absence",9252042,"Primary",9252042,"South Witham Academy",78,0,0,2,2.564102564102564E-2,8,0.10256410256410256,22,0.28205128205128205,46,0.58974358974358976,0.95371621621621616,"As expected"]
[null,null,"Primary",9252042,"South Witham Academy",85,0,0,8,9.4117647058823528E-2,9,0.10588235294117647,11,0.12941176470588237,57,0.6705882352941176,0.94240196078431371,"At risk of persistent absence",null,"Primary",9252043,"Gosberton Academy",119,0,0,0,0,21,0.17647058823529413,33,0.27731092436974791,65,0.54621848739495793,0.94833995641584412,"At risk of persistent absence",9252043,"Primary",9252043,"Gosberton Academy",119,0,0,1,8.4033613445378148E-3,16,0.13445378151260504,23,0.19327731092436976,79,0.66386554621848737,0.95921472037090694,"As expected"]
[null,null,"Primary",9252043,"Gosberton Academy",137,0,0,13,9.4890510948905105E-2,22,0.16058394160583941,13,9.4890510948905105E-2,89,0.64963503649635035,0.93751630576571876,"At risk of persistent absence",null,"Primary",9252045,"Chapel St Leonards Primary School",128,1,7.8125E-3,16,0.125,19,0.1484375,24,0.1875,68,0.53125,0.92630551488530988,"At risk of persistent absence",9252045,"Primary",9252045,"Chapel St Leonards Primary School",125,0,0,10,0.08,24,0.192,23,0.184,68,0.54400000000000004,0.92901682134570762,"At risk of persistent absence"]
[null,null,"Primary",9252045,"Chapel St Leonards Primary School",153,2,1.3071895424836602E-2,8,5.2287581699346407E-2,23,0.15032679738562091,20,0.13071895424836602,100,0.65359477124183007,0.94517909872897676,"At risk of persistent absence",null,"Primary",9252047,"Holbeach Bank Academy",64,0,0,2,3.125E-2,7,0.109375,8,0.125,47,0.734375,0.9567886374578719,"As expected",9252047,"Primary",9252047,"Holbeach Bank Academy",67,0,0,2,2.9850746268656716E-2,12,0.17910447761194029,15,0.22388059701492538,38,0.56716417910447758,0.9555164954029205,"As expected"]
[null,null,"Primary",9252047,"Holbeach Bank Academy",70,1,1.4285714285714285E-2,7,0.1,9,0.12857142857142856,7,0.1,46,0.65714285714285714,0.93819925412892913,"At risk of persistent absence",null,"Primary",9252048,"Poplar Farm School",236,0,0,6,2.5423728813559324E-2,26,0.11016949152542373,49,0.2076271186440678,155,0.65677966101694918,0.9578698376166731,"As expected",9252048,"Primary",9252048,"Poplar Farm School",238,0,0,5,2.100840336134454E-2,23,9.6638655462184878E-2,51,0.21428571428571427,159,0.66806722689075626,0.95550274223034737,"As expected"]
[null,null,"Primary",9252048,"Poplar Farm School",226,0,0,7,3.0973451327433628E-2,21,9.2920353982300891E-2,23,0.10176991150442478,175,0.77433628318584069,0.9672804998355804,"As expected",null,"Primary",9252049,"Colsterworth CE Primary School",98,0,0,6,6.1224489795918366E-2,18,0.18367346938775511,24,0.24489795918367346,50,0.51020408163265307,0.93114304165321282,"At risk of persistent absence",9252049,"Primary",9252049,"Colsterworth CE Primary School",100,0,0,1,0.01,11,0.11,18,0.18,70,0.7,0.96307068570421295,"As expected"]
[null,null,"Primary",9252049,"Colsterworth CE Primary School",111,2,1.8018018018018018E-2,2,1.8018018018018018E-2,15,0.13513513513513514,4,3.6036036036036036E-2,88,0.7927927927927928,0.95417653026716265,"As expected",null,"Primary",9252050,"Walcott Primary School",79,0,0,2,2.5316455696202531E-2,14,0.17721518987341772,10,0.12658227848101267,53,0.67088607594936711,0.95029974859795008,"As expected",9252050,"Primary",9252050,"Walcott Primary School",80,0,0,1,1.2500000000000001E-2,6,7.4999999999999997E-2,18,0.22500000000000001,55,0.6875,0.96263403010939019,"As expected"]
[null,null,"Primary",9252050,"Walcott Primary School",85,0,0,8,9.4117647058823528E-2,23,0.27058823529411763,8,9.4117647058823528E-2,46,0.54117647058823526,0.92658730158730163,"At risk of persistent absence",null,"Primary",9252054,"Grantham Belton Lane Community Primary",289,3,1.0380622837370242E-2,11,3.8062283737024222E-2,43,0.14878892733564014,64,0.22145328719723184,168,0.58131487889273359,0.94043799337916989,"At risk of persistent absence",9252054,"Primary",9252054,"Grantham Belton Lane Community Primary",291,2,6.8728522336769758E-3,3,1.0309278350515464E-2,41,0.14089347079037801,65,0.22336769759450173,180,0.61855670103092786,0.95204664445502141,"As expected"]
[null,null,"Primary",9252054,"Grantham Belton Lane Community Primary",325,2,6.1538461538461538E-3,17,5.2307692307692305E-2,56,0.1723076923076923,32,9.8461538461538461E-2,218,0.67076923076923078,0.94522198003900426,"At risk of persistent absence",null,"Primary",9252055,"Grantham Cliffedale Primary School",255,1,3.9215686274509803E-3,5,1.9607843137254902E-2,26,0.10196078431372549,36,0.14117647058823529,187,0.73333333333333328,0.95866421713879346,"As expected",9252055,"Primary",9252055,"Grantham Cliffedale Primary School",256,0,0,4,1.5625E-2,29,0.11328125,59,0.23046875,164,0.640625,0.95688923588716523,"As expected"]
[null,null,"Primary",9252055,"Grantham Cliffedale Primary School",293,0,0,9,3.0716723549488054E-2,29,9.8976109215017066E-2,34,0.11604095563139932,221,0.75426621160409557,0.96459385185658597,"As expected",null,"Primary",9252057,"Fosse Way Academy",417,0,0,9,2.1582733812949641E-2,62,0.14868105515587529,81,0.19424460431654678,265,0.63549160671462834,0.95232815964523276,"As expected",9252057,"Primary",9252057,"Fosse Way Academy",418,1,2.3923444976076554E-3,7,1.6746411483253589E-2,50,0.11961722488038277,85,0.20334928229665072,275,0.65789473684210531,0.95527769577868682,"As expected"]
[null,null,"Primary",9252057,"Fosse Way Academy",496,1,2.0161290322580645E-3,19,3.8306451612903226E-2,68,0.13709677419354838,72,0.14516129032258066,336,0.67741935483870963,0.953125,"As expected",null,"Primary",9252058,"Hartsholme Academy",346,2,5.7803468208092483E-3,24,6.9364161849710976E-2,60,0.17341040462427745,63,0.18208092485549132,197,0.56936416184971095,0.93310943184998596,"At risk of persistent absence",9252058,"Primary",9252058,"Hartsholme Academy",350,3,8.5714285714285719E-3,17,4.8571428571428571E-2,58,0.1657142857142857,74,0.21142857142857144,198,0.56571428571428573,0.93941387862529735,"At risk of persistent absence"]
[null,null,"Primary",9252058,"Hartsholme Academy",398,3,7.537688442211055E-3,31,7.7889447236180909E-2,64,0.16080402010050251,76,0.19095477386934673,224,0.56281407035175879,0.9325600215807931,"At risk of persistent absence",null,"Primary",9252061,"Waddington Redwood Primary Academy",269,6,2.2304832713754646E-2,8,2.9739776951672861E-2,34,0.12639405204460966,46,0.17100371747211895,175,0.65055762081784385,0.9463599413830287,"At risk of persistent absence",9252061,"Primary",9252061,"Waddington Redwood Primary Academy",264,3,1.1363636363636364E-2,4,1.5151515151515152E-2,23,8.7121212121212127E-2,57,0.21590909090909091,177,0.67045454545454541,0.9544899508267054,"As expected"]
[null,null,"Primary",9252061,"Waddington Redwood Primary Academy",297,2,6.7340067340067337E-3,13,4.3771043771043773E-2,35,0.11784511784511785,38,0.12794612794612795,209,0.70370370370370372,0.94694417709335899,"At risk of persistent absence",null,"Primary",9252062,"Deeping St. James C.P.  School",183,0,0,6,3.2786885245901641E-2,28,0.15300546448087432,42,0.22950819672131148,107,0.58469945355191255,0.94185670386543752,"At risk of persistent absence",9252062,"Primary",9252062,"Deeping St. James C.P.  School",183,1,5.4644808743169399E-3,0,0,17,9.2896174863387984E-2,39,0.21311475409836064,126,0.68852459016393441,0.96109980597226818,"As expected"]
[null,null,"Primary",9252062,"Deeping St. James C.P.  School",212,0,0,3,1.4150943396226415E-2,29,0.13679245283018868,19,8.9622641509433956E-2,161,0.75943396226415094,0.96495531803048884,"As expected",null,"Primary",9252063,"St. Giles Academy",360,18,0.05,45,0.125,62,0.17222222222222222,79,0.21944444444444444,156,0.43333333333333335,0.90416050778193202,"Persistent absence",9252063,"Primary",9252063,"St. Giles Academy",355,11,3.0985915492957747E-2,31,8.7323943661971826E-2,72,0.20281690140845071,82,0.23098591549295774,159,0.44788732394366199,0.91748461577582263,"At risk of persistent absence"]
[null,null,"Primary",9252063,"St. Giles Academy",404,5,1.2376237623762377E-2,28,6.9306930693069313E-2,73,0.18069306930693069,59,0.14603960396039603,239,0.59158415841584155,0.93380583043594545,"At risk of persistent absence",null,"Primary",9252064,"North Hykeham Ling Moor Primary Academy",361,1,2.7700831024930748E-3,2,5.5401662049861496E-3,25,6.9252077562326875E-2,66,0.18282548476454294,267,0.73961218836565101,0.96605886633783455,"As expected",9252064,"Primary",9252064,"North Hykeham Ling Moor Primary Academy",361,1,2.7700831024930748E-3,4,1.1080332409972299E-2,42,0.11634349030470914,72,0.1994459833795014,242,0.67036011080332414,0.95892290105423594,"As expected"]
[null,null,"Primary",9252064,"North Hykeham Ling Moor Primary Academy",419,1,2.3866348448687352E-3,18,4.2959427207637228E-2,38,9.0692124105011929E-2,56,0.13365155131264916,306,0.73031026252983289,0.95933638346089711,"As expected",null,"Primary",9252065,"Market Deeping Community Primary School",271,1,3.6900369003690036E-3,11,4.0590405904059039E-2,37,0.13653136531365315,56,0.20664206642066421,166,0.61254612546125464,0.94386580418813726,"At risk of persistent absence",9252065,"Primary",9252065,"Market Deeping Community Primary School",272,1,3.6764705882352941E-3,6,2.2058823529411766E-2,20,7.3529411764705885E-2,57,0.20955882352941177,188,0.69117647058823528,0.95755436856161769,"As expected"]
[null,null,"Primary",9252065,"Market Deeping Community Primary School",318,3,9.433962264150943E-3,13,4.0880503144654086E-2,45,0.14150943396226415,46,0.14465408805031446,211,0.66352201257861632,0.94767100786108183,"At risk of persistent absence",null,"Primary",9252066,"The Bluecoat School",161,0,0,0,0,0,0,0,0,161,1,1,"As expected",9252066,"Primary",9252066,"The Bluecoat School",154,0,0,0,0,0,0,0,0,154,1,1,"As expected"]
[null,null,"Primary",9252066,"The Bluecoat School",181,0,0,0,0,0,0,0,0,181,1,1,"As expected",null,"Primary",9252067,"The Holt Primary School",165,0,0,1,6.0606060606060606E-3,18,0.10909090909090909,30,0.18181818181818182,116,0.70303030303030301,0.96081702588150419,"As expected",9252067,"Primary",9252067,"The Holt Primary School",165,0,0,2,1.2121212121212121E-2,16,9.696969696969697E-2,33,0.2,114,0.69090909090909092,0.96059526304757914,"As expected"]
[null,null,"Primary",9252067,"The Holt Primary School",195,1,5.1282051282051282E-3,28,0.14358974358974358,33,0.16923076923076924,24,0.12307692307692308,109,0.55897435897435899,0.92185568970434451,"At risk of persistent absence",null,"Primary",9252069,"Thurlby Community Primary",175,0,0,9,5.1428571428571428E-2,37,0.21142857142857144,34,0.19428571428571428,95,0.54285714285714282,0.93305697653907216,"At risk of persistent absence",9252069,"Primary",9252069,"Thurlby Community Primary",176,0,0,6,3.4090909090909088E-2,18,0.10227272727272728,41,0.23295454545454544,111,0.63068181818181823,0.95784825371336813,"As expected"]
[null,null,"Primary",9252069,"Thurlby Community Primary",187,0,0,7,3.7433155080213901E-2,25,0.13368983957219252,15,8.0213903743315509E-2,139,0.74331550802139035,0.95822506496102333,"As expected",null,"Primary",9252070,"Grantham Belmont CP School",183,6,3.2786885245901641E-2,11,6.0109289617486336E-2,34,0.18579234972677597,42,0.22950819672131148,90,0.49180327868852458,0.91865733113673809,"At risk of persistent absence",9252070,"Primary",9252070,"Grantham Belmont CP School",179,0,0,12,6.7039106145251395E-2,27,0.15083798882681565,33,0.18435754189944134,107,0.5977653631284916,0.94006385448916407,"At risk of persistent absence"]
[null,null,"Primary",9252070,"Grantham Belmont CP School",211,2,9.4786729857819912E-3,16,7.582938388625593E-2,36,0.17061611374407584,21,9.9526066350710901E-2,135,0.6398104265402843,0.9307180133165377,"At risk of persistent absence",null,"Primary",9252072,"Bourne Westfield  Primary Academy",543,0,0,9,1.6574585635359115E-2,64,0.11786372007366483,95,0.17495395948434622,375,0.69060773480662985,0.95577154089767391,"As expected",9252072,"Primary",9252072,"Bourne Westfield  Primary Academy",542,4,7.3800738007380072E-3,13,2.3985239852398525E-2,55,0.1014760147601476,112,0.20664206642066421,358,0.66051660516605171,0.95494398050938467,"As expected"]
[null,null,"Primary",9252072,"Bourne Westfield  Primary Academy",627,1,1.594896331738437E-3,17,2.7113237639553429E-2,80,0.12759170653907495,73,0.11642743221690591,456,0.72727272727272729,0.96103124628727576,"As expected",null,"Primary",9252073,"St Nicholas CE Primary Academy",176,2,1.1363636363636364E-2,5,2.8409090909090908E-2,39,0.22159090909090909,42,0.23863636363636365,88,0.5,0.93380850971359031,"At risk of persistent absence",9252073,"Primary",9252073,"St Nicholas CE Primary Academy",177,5,2.8248587570621469E-2,10,5.6497175141242938E-2,37,0.20903954802259886,36,0.20338983050847459,89,0.50282485875706218,0.92406471183013139,"At risk of persistent absence"]
[null,null,"Primary",9252073,"St Nicholas CE Primary Academy",201,2,9.9502487562189053E-3,12,5.9701492537313432E-2,41,0.20398009950248755,30,0.14925373134328357,116,0.57711442786069655,0.93564909666604579,"At risk of persistent absence",null,"Primary",9252074,"Branston Junior Academy",171,0,0,7,4.0935672514619881E-2,21,0.12280701754385964,40,0.23391812865497075,103,0.60233918128654973,0.94628910510929798,"At risk of persistent absence",9252074,"Primary",9252074,"Branston Junior Academy",171,1,5.8479532163742687E-3,11,6.4327485380116955E-2,22,0.12865497076023391,29,0.16959064327485379,108,0.63157894736842102,0.94486190089358246,"At risk of persistent absence"]
[null,null,"Primary",9252074,"Branston Junior Academy",164,1,6.0975609756097563E-3,8,4.878048780487805E-2,22,0.13414634146341464,28,0.17073170731707318,105,0.6402439024390244,0.9474932249322493,"At risk of persistent absence",null,"Primary",9252075,"Heighington Millfield Primary Academy",228,0,0,8,3.5087719298245612E-2,35,0.15350877192982457,56,0.24561403508771928,129,0.56578947368421051,0.94521861416517516,"At risk of persistent absence",9252075,"Primary",9252075,"Heighington Millfield Primary Academy",229,0,0,3,1.3100436681222707E-2,19,8.296943231441048E-2,40,0.17467248908296942,167,0.72925764192139741,0.96658811008058387,"As expected"]
[null,null,"Primary",9252075,"Heighington Millfield Primary Academy",272,0,0,3,1.1029411764705883E-2,29,0.10661764705882353,31,0.11397058823529412,209,0.76838235294117652,0.96965907595103329,"As expected",null,"Primary",9252077,"The Spalding Parish Church of England Day School",498,1,2.008032128514056E-3,14,2.8112449799196786E-2,109,0.21887550200803213,104,0.20883534136546184,270,0.54216867469879515,0.94069658930130351,"At risk of persistent absence",9252077,"Primary",9252077,"The Spalding Parish Church of England Day School",501,1,1.996007984031936E-3,13,2.5948103792415168E-2,62,0.12375249500998003,112,0.22355289421157684,313,0.62475049900199597,0.9531189868103418,"As expected"]
[null,null,"Primary",9252077,"The Spalding Parish Church of England Day School",579,4,6.9084628670120895E-3,35,6.0449050086355788E-2,91,0.15716753022452504,77,0.13298791018998274,372,0.6424870466321243,0.94098939929328618,"At risk of persistent absence",null,"Primary",9252078,"Ermine Primary Academy",340,3,8.8235294117647058E-3,22,6.4705882352941183E-2,78,0.22941176470588234,78,0.22941176470588234,159,0.46764705882352942,0.91986987983801372,"At risk of persistent absence",9252078,"Primary",9252078,"Ermine Primary Academy",346,9,2.6011560693641619E-2,6,1.7341040462427744E-2,56,0.16184971098265896,83,0.23988439306358381,192,0.55491329479768781,0.93256183112294533,"At risk of persistent absence"]
[null,null,"Primary",9252078,"Ermine Primary Academy",387,5,1.2919896640826873E-2,20,5.1679586563307491E-2,69,0.17829457364341086,71,0.1834625322997416,222,0.5736434108527132,0.93707928197456991,"At risk of persistent absence",null,"Primary",9252079,"Linchfield Academy",297,4,1.3468013468013467E-2,4,1.3468013468013467E-2,37,0.12457912457912458,60,0.20202020202020202,192,0.64646464646464652,0.95028089887640455,"As expected",9252079,"Primary",9252079,"Linchfield Academy",301,5,1.6611295681063124E-2,5,1.6611295681063124E-2,33,0.10963455149501661,58,0.19269102990033224,200,0.66445182724252494,0.95630752891196602,"As expected"]
[null,null,"Primary",9252079,"Linchfield Academy",347,0,0,9,2.5936599423631124E-2,37,0.10662824207492795,48,0.13832853025936601,253,0.72910662824207495,0.96362754607177492,"As expected",null,"Primary",9252080,"St Pauls County Primary School",177,1,5.6497175141242938E-3,20,0.11299435028248588,66,0.3728813559322034,30,0.16949152542372881,60,0.33898305084745761,0.89884735065959587,"Persistent absence",9252080,"Primary",9252080,"St Pauls County Primary School",177,1,5.6497175141242938E-3,14,7.909604519774012E-2,33,0.1864406779661017,53,0.29943502824858759,76,0.42937853107344631,0.92604194319086808,"At risk of persistent absence"]
[null,null,"Primary",9252080,"St Pauls County Primary School",200,2,0.01,16,0.08,48,0.24,23,0.115,111,0.55500000000000005,0.92775056518462695,"At risk of persistent absence",null,"Primary",9252084,"Crowland South View CP School",352,1,2.840909090909091E-3,18,5.113636363636364E-2,60,0.17045454545454544,93,0.26420454545454547,180,0.51136363636363635,0.9347627833980191,"At risk of persistent absence",9252084,"Primary",9252084,"Crowland South View CP School",358,1,2.7932960893854749E-3,10,2.7932960893854747E-2,58,0.16201117318435754,76,0.21229050279329609,213,0.5949720670391061,0.94576403453153202,"At risk of persistent absence"]
[null,null,"Primary",9252084,"Crowland South View CP School",388,2,5.1546391752577319E-3,29,7.4742268041237112E-2,62,0.15979381443298968,48,0.12371134020618557,247,0.63659793814432986,0.93938526155020996,"At risk of persistent absence",null,"Primary",9252085,"Deeping St Nicholas Primary School",51,0,0,1,1.9607843137254902E-2,10,0.19607843137254902,15,0.29411764705882354,25,0.49019607843137253,0.94188405797101449,"At risk of persistent absence",9252085,"Primary",9252085,"Deeping St Nicholas Primary School",53,0,0,0,0,11,0.20754716981132076,13,0.24528301886792453,29,0.54716981132075471,0.94967587853974755,"At risk of persistent absence"]
[null,null,"Primary",9252085,"Deeping St Nicholas Primary School",63,0,0,1,1.5873015873015872E-2,17,0.26984126984126983,3,4.7619047619047616E-2,42,0.66666666666666663,0.95017182130584188,"As expected",null,"Primary",9252086,"Surfleet Primary School",69,1,1.4492753623188406E-2,4,5.7971014492753624E-2,8,0.11594202898550725,13,0.18840579710144928,43,0.62318840579710144,0.93783783783783781,"At risk of persistent absence",9252086,"Primary",9252086,"Surfleet Primary School",71,1,1.4084507042253521E-2,3,4.2253521126760563E-2,13,0.18309859154929578,17,0.23943661971830985,37,0.52112676056338025,0.93681605002605528,"At risk of persistent absence"]
[null,null,"Primary",9252086,"Surfleet Primary School",77,1,1.2987012987012988E-2,4,5.1948051948051951E-2,10,0.12987012987012986,8,0.1038961038961039,54,0.70129870129870131,0.94920558497833418,"At risk of persistent absence",null,"Primary",9252087,"Fleet Wood Lane Primary School",162,0,0,12,7.407407407407407E-2,33,0.20370370370370369,40,0.24691358024691357,77,0.47530864197530864,0.92704225352112679,"At risk of persistent absence",9252087,"Primary",9252087,"Fleet Wood Lane Primary School",159,1,6.2893081761006293E-3,8,5.0314465408805034E-2,30,0.18867924528301888,36,0.22641509433962265,84,0.52830188679245282,0.93629834254143651,"At risk of persistent absence"]
[null,null,"Primary",9252087,"Fleet Wood Lane Primary School",187,5,2.6737967914438502E-2,5,2.6737967914438502E-2,24,0.12834224598930483,25,0.13368983957219252,128,0.68449197860962563,0.94386527666399356,"At risk of persistent absence",null,"Primary",9252088,"Gedney Church End Primary Academy",66,0,0,7,0.10606060606060606,24,0.36363636363636365,13,0.19696969696969696,22,0.33333333333333331,0.90076249004210762,"Persistent absence",{"$f":"AL81*1","v":9252088},"Primary",9252088,"Gedney Church End Primary Academy",70,2,2.8571428571428571E-2,10,0.14285714285714285,17,0.24285714285714285,24,0.34285714285714286,17,0.24285714285714285,0.88862370723945905,"Persistent absence"]
[null,null,"Primary",9252088,"Gedney Church End Primary Academy",76,0,0,7,9.2105263157894732E-2,12,0.15789473684210525,11,0.14473684210526316,46,0.60526315789473684,0.93774509803921569,"At risk of persistent absence",null,"Primary",9252089,"Gedney Drove End School",37,0,0,2,5.4054054054054057E-2,13,0.35135135135135137,5,0.13513513513513514,17,0.45945945945945948,0.92363112391930835,"At risk of persistent absence",9252089,"Primary",9252089,"Gedney Drove End School",37,2,5.4054054054054057E-2,2,5.4054054054054057E-2,9,0.24324324324324326,8,0.21621621621621623,16,0.43243243243243246,0.91956077630234934,"At risk of persistent absence"]
[null,null,"Primary",9252089,"Gedney Drove End School",39,0,0,5,0.12820512820512819,3,7.6923076923076927E-2,2,5.128205128205128E-2,29,0.74358974358974361,0.95299145299145294,"As expected",null,"Primary",9252091,"Clough and Risegate CP School",77,0,0,0,0,4,5.1948051948051951E-2,16,0.20779220779220781,57,0.74025974025974028,0.96563043058505504,"As expected",9252091,"Primary",9252091,"Clough and Risegate CP School",78,0,0,0,0,5,6.4102564102564097E-2,17,0.21794871794871795,56,0.71794871794871795,0.96933751119068934,"As expected"]
[null,null,"Primary",9252091,"Clough and Risegate CP School",87,0,0,3,3.4482758620689655E-2,15,0.17241379310344829,7,8.0459770114942528E-2,62,0.71264367816091956,0.95813653928724773,"As expected",null,"Primary",9252093,"Holbeach Primary",275,0,0,13,4.7272727272727272E-2,49,0.17818181818181819,65,0.23636363636363636,148,0.53818181818181821,0.9365602138055773,"At risk of persistent absence",9252093,"Primary",9252093,"Holbeach Primary",277,2,7.2202166064981952E-3,10,3.6101083032490974E-2,38,0.13718411552346571,64,0.23104693140794225,163,0.58844765342960292,0.94693685202639022,"At risk of persistent absence"]
[null,null,"Primary",9252093,"Holbeach Primary",312,4,1.282051282051282E-2,21,6.7307692307692304E-2,51,0.16346153846153846,47,0.15064102564102563,189,0.60576923076923073,0.93187767729652549,"At risk of persistent absence",null,"Primary",9252094,"KIRTON PRIMARY SCHOOL",452,2,4.4247787610619468E-3,18,3.9823008849557522E-2,126,0.27876106194690264,87,0.19247787610619468,219,0.48451327433628316,0.92825960915384875,"At risk of persistent absence",9252094,"Primary",9252094,"KIRTON PRIMARY SCHOOL",456,8,1.7543859649122806E-2,19,4.1666666666666664E-2,65,0.14254385964912281,111,0.24342105263157895,253,0.55482456140350878,0.93693607585257688,"At risk of persistent absence"]
[null,null,"Primary",9252094,"KIRTON PRIMARY SCHOOL",527,9,1.7077798861480076E-2,35,6.6413662239089177E-2,87,0.16508538899430741,69,0.13092979127134724,326,0.61859582542694502,0.93494265892680162,"At risk of persistent absence",null,"Primary",9252095,"Long Sutton Primary",352,2,5.681818181818182E-3,19,5.3977272727272728E-2,66,0.1875,90,0.25568181818181818,175,0.49715909090909088,0.93198003466783619,"At risk of persistent absence",9252095,"Primary",9252095,"Long Sutton Primary",350,1,2.8571428571428571E-3,16,4.5714285714285714E-2,57,0.16285714285714287,80,0.22857142857142856,196,0.56000000000000005,0.94140751236731546,"At risk of persistent absence"]
[null,null,"Primary",9252095,"Long Sutton Primary",404,4,9.9009900990099011E-3,30,7.4257425742574254E-2,58,0.14356435643564355,42,0.10396039603960396,270,0.66831683168316836,0.93942872887582662,"At risk of persistent absence",null,"Primary",9252096,"Moulton Chapel Primary School",64,0,0,1,1.5625E-2,10,0.15625,12,0.1875,41,0.640625,0.95198065407646248,"As expected",9252096,"Primary",9252096,"Moulton Chapel Primary School",65,0,0,1,1.5384615384615385E-2,8,0.12307692307692308,13,0.2,43,0.66153846153846152,0.95709703287890935,"As expected"]
[null,null,"Primary",9252096,"Moulton Chapel Primary School",74,0,0,2,2.7027027027027029E-2,5,6.7567567567567571E-2,8,0.10810810810810811,59,0.79729729729729726,0.97322322322322319,"As expected",null,"Primary",9252097,"The John Harrox  Primary School",225,3,1.3333333333333334E-2,5,2.2222222222222223E-2,29,0.12888888888888889,51,0.22666666666666666,137,0.60888888888888892,0.94732767905223481,"At risk of persistent absence",9252097,"Primary",9252097,"The John Harrox  Primary School",225,1,4.4444444444444444E-3,2,8.8888888888888889E-3,24,0.10666666666666667,37,0.16444444444444445,161,0.7155555555555555,0.95987390052152255,"As expected"]
[null,null,"Primary",9252097,"The John Harrox  Primary School",259,1,3.8610038610038611E-3,20,7.7220077220077218E-2,37,0.14285714285714285,23,8.8803088803088806E-2,178,0.68725868725868722,0.94514162782359268,"At risk of persistent absence",null,"Primary",9252099,"The West Grantham Church of England Primary Academy",224,8,3.5714285714285712E-2,24,0.10714285714285714,42,0.1875,49,0.21875,101,0.45089285714285715,0.91451500348918358,"At risk of persistent absence",9252099,"Primary",9252099,"The West Grantham Church of England Primary Academy",217,2,9.2165898617511521E-3,13,5.9907834101382486E-2,51,0.23502304147465439,43,0.19815668202764977,108,0.49769585253456222,0.92928365805832536,"At risk of persistent absence"]
[null,null,"Primary",9252099,"The West Grantham Church of England Primary Academy",268,3,1.1194029850746268E-2,18,6.7164179104477612E-2,64,0.23880597014925373,35,0.13059701492537312,148,0.55223880597014929,0.92854125598422976,"At risk of persistent absence",null,"Primary",9252104,"Sutton St James Community Primary School",99,0,0,3,3.0303030303030304E-2,13,0.13131313131313133,20,0.20202020202020202,63,0.63636363636363635,0.95135421395067332,"As expected",9252104,"Primary",9252104,"Sutton St James Community Primary School",98,0,0,2,2.0408163265306121E-2,20,0.20408163265306123,27,0.27551020408163263,49,0.5,0.94118682866701886,"At risk of persistent absence"]
[null,null,"Primary",9252104,"Sutton St James Community Primary School",105,0,0,1,9.5238095238095247E-3,9,8.5714285714285715E-2,11,0.10476190476190476,84,0.8,0.97187831623629284,"As expected",null,"Primary",9252105,"Lutton St.Nicholas Primary Academy",88,0,0,2,2.2727272727272728E-2,16,0.18181818181818182,19,0.21590909090909091,51,0.57954545454545459,0.94268774703557312,"At risk of persistent absence",9252105,"Primary",9252105,"Lutton St.Nicholas Primary Academy",90,0,0,2,2.2222222222222223E-2,30,0.33333333333333331,17,0.18888888888888888,41,0.45555555555555555,0.9292233009708738,"At risk of persistent absence"]
[null,null,"Primary",9252105,"Lutton St.Nicholas Primary Academy",95,1,1.0526315789473684E-2,4,4.2105263157894736E-2,14,0.14736842105263157,9,9.4736842105263161E-2,67,0.70526315789473681,0.95118577075098809,"As expected",null,"Primary",9252107,"Shepeau Stow Primary",60,1,1.6666666666666666E-2,1,1.6666666666666666E-2,17,0.28333333333333333,17,0.28333333333333333,24,0.4,0.92387040534650589,"At risk of persistent absence",9252107,"Primary",9252107,"Shepeau Stow Primary",64,2,3.125E-2,2,3.125E-2,22,0.34375,9,0.140625,29,0.453125,0.91332858161083397,"At risk of persistent absence"]
[null,null,"Primary",9252107,"Shepeau Stow Primary",59,1,1.6949152542372881E-2,5,8.4745762711864403E-2,4,6.7796610169491525E-2,6,0.10169491525423729,43,0.72881355932203384,0.93910860012554931,"At risk of persistent absence",null,"Primary",9252113,"Boston Hawthorn Tree School",311,3,9.6463022508038593E-3,17,5.4662379421221867E-2,74,0.23794212218649519,77,0.24758842443729903,140,0.45016077170418006,0.9243222157206944,"At risk of persistent absence",9252113,"Primary",9252113,"Boston Hawthorn Tree School",310,9,2.903225806451613E-2,12,3.870967741935484E-2,53,0.17096774193548386,68,0.21935483870967742,168,0.54193548387096779,0.93342816500711234,"At risk of persistent absence"]
[null,null,"Primary",9252113,"Boston Hawthorn Tree School",359,3,8.356545961002786E-3,20,5.5710306406685235E-2,57,0.15877437325905291,39,0.10863509749303621,240,0.66852367688022285,0.94355089758223509,"At risk of persistent absence",null,"Primary",9252114,"The Spalding Monkshouse Primary School",361,1,2.7700831024930748E-3,20,5.5401662049861494E-2,86,0.23822714681440443,87,0.24099722991689751,167,0.46260387811634351,0.92532533757598012,"At risk of persistent absence",9252114,"Primary",9252114,"The Spalding Monkshouse Primary School",362,3,8.2872928176795577E-3,9,2.4861878453038673E-2,71,0.19613259668508287,57,0.15745856353591159,222,0.61325966850828728,0.94526861587210143,"At risk of persistent absence"]
[null,null,"Primary",9252114,"The Spalding Monkshouse Primary School",422,2,4.7393364928909956E-3,25,5.9241706161137442E-2,69,0.16350710900473933,45,0.1066350710900474,280,0.6635071090047393,0.94082029523556965,"At risk of persistent absence",null,"Primary",9252116,"Boston West Academy",359,1,2.7855153203342618E-3,16,4.456824512534819E-2,65,0.18105849582172701,89,0.24791086350974931,188,0.5236768802228412,0.93431037358238822,"At risk of persistent absence",9252116,"Primary",9252116,"Boston West Academy",362,0,0,7,1.9337016574585635E-2,63,0.17403314917127072,73,0.20165745856353592,219,0.60497237569060769,0.94987041658667692,"At risk of persistent absence"]
[null,null,"Primary",9252116,"Boston West Academy",412,3,7.2815533980582527E-3,19,4.6116504854368932E-2,58,0.14077669902912621,52,0.12621359223300971,280,0.67961165048543692,0.94875720461095103,"At risk of persistent absence",null,"Primary",9252120,"Sir Francis Hill Community Primary School",509,5,9.823182711198428E-3,28,5.50098231827112E-2,92,0.18074656188605109,100,0.19646365422396855,284,0.55795677799607069,0.93395079334103903,"At risk of persistent absence",9252120,"Primary",9252120,"Sir Francis Hill Community Primary School",512,6,1.171875E-2,31,6.0546875E-2,80,0.15625,95,0.185546875,300,0.5859375,0.93432264895233863,"At risk of persistent absence"]
[null,null,"Primary",9252120,"Sir Francis Hill Community Primary School",540,10,1.8518518518518517E-2,22,4.0740740740740744E-2,99,0.18333333333333332,82,0.15185185185185185,327,0.60555555555555551,0.93292581086949256,"At risk of persistent absence",null,"Primary",9252122,"Bracebridge Infant and Nursery Sch",40,1,2.5000000000000001E-2,0,0,6,0.15,8,0.2,25,0.625,0.94303797468354433,"At risk of persistent absence",9252122,"Primary",9252122,"Bracebridge Infant and Nursery Sch",44,1,2.2727272727272728E-2,1,2.2727272727272728E-2,6,0.13636363636363635,8,0.18181818181818182,28,0.63636363636363635,0.93124733929331627,"At risk of persistent absence"]
[null,null,"Primary",9252122,"Bracebridge Infant and Nursery Sch",56,1,1.7857142857142856E-2,2,3.5714285714285712E-2,12,0.21428571428571427,10,0.17857142857142858,31,0.5535714285714286,0.93435013262599464,"At risk of persistent absence",null,"Primary",9252124,"Lincoln Monks Abbey Primary School",443,0,0,17,3.8374717832957109E-2,54,0.12189616252821671,88,0.19864559819413091,284,0.64108352144469527,0.94947078564667409,"At risk of persistent absence",9252124,"Primary",9252124,"Lincoln Monks Abbey Primary School",443,3,6.7720090293453723E-3,22,4.9661399548532728E-2,97,0.21896162528216703,76,0.17155756207674944,245,0.55304740406320541,0.93833255309188413,"At risk of persistent absence"]
[null,null,"Primary",9252124,"Lincoln Monks Abbey Primary School",495,1,2.0202020202020202E-3,44,8.8888888888888892E-2,100,0.20202020202020202,62,0.12525252525252525,287,0.57979797979797976,0.93053231939163494,"At risk of persistent absence",null,"Primary",9252135,"Woodlands Infant and Nursery School",75,0,0,4,5.3333333333333337E-2,15,0.2,16,0.21333333333333335,40,0.53333333333333333,0.93960591133004923,"At risk of persistent absence",9252135,"Primary",9252135,"Woodlands Infant and Nursery School",74,0,0,1,1.3513513513513514E-2,12,0.16216216216216217,16,0.21621621621621623,45,0.60810810810810811,0.95246971109040079,"As expected"]
[null,null,"Primary",9252135,"Woodlands Infant and Nursery School",106,0,0,10,9.4339622641509441E-2,25,0.23584905660377359,19,0.17924528301886791,52,0.49056603773584906,0.92365478686233404,"At risk of persistent absence",null,"Primary",9252136,"Lincoln Manor Leas Junior Academy",278,1,3.5971223021582736E-3,11,3.9568345323741004E-2,32,0.11510791366906475,44,0.15827338129496402,190,0.68345323741007191,0.95366000877963131,"As expected",9252136,"Primary",9252136,"Lincoln Manor Leas Junior Academy",281,0,0,15,5.3380782918149468E-2,32,0.11387900355871886,59,0.20996441281138789,175,0.62277580071174377,0.94567341999937948,"At risk of persistent absence"]
[null,null,"Primary",9252136,"Lincoln Manor Leas Junior Academy",279,2,7.1684587813620072E-3,13,4.6594982078853049E-2,36,0.12903225806451613,37,0.13261648745519714,191,0.68458781362007171,0.95188089857769509,"As expected",null,"Primary",9252137,"Lincoln, Manor Leas Infants",115,1,8.6956521739130436E-3,1,8.6956521739130436E-3,15,0.13043478260869565,26,0.22608695652173913,72,0.62608695652173918,0.95082074852265264,"As expected",9252137,"Primary",9252137,"Lincoln, Manor Leas Infants",116,1,8.6206896551724137E-3,1,8.6206896551724137E-3,11,9.4827586206896547E-2,28,0.2413793103448276,75,0.64655172413793105,0.95326963272618692,"As expected"]
[null,null,"Primary",9252137,"Lincoln, Manor Leas Infants",154,2,1.2987012987012988E-2,8,5.1948051948051951E-2,22,0.14285714285714285,18,0.11688311688311688,104,0.67532467532467533,0.94426867851058649,"At risk of persistent absence",null,"Primary",9252142,"Alford Primary School",288,1,3.472222222222222E-3,15,5.2083333333333336E-2,66,0.22916666666666666,49,0.1701388888888889,157,0.54513888888888884,0.93178742452633767,"At risk of persistent absence",9252142,"Primary",9252142,"Alford Primary School",288,1,3.472222222222222E-3,15,5.2083333333333336E-2,54,0.1875,64,0.22222222222222221,154,0.53472222222222221,0.93514200932598557,"At risk of persistent absence"]
[null,null,"Primary",9252142,"Alford Primary School",343,1,2.9154518950437317E-3,25,7.2886297376093298E-2,51,0.14868804664723032,34,9.9125364431486881E-2,232,0.67638483965014573,0.94371329127691972,"At risk of persistent absence",null,"Primary",9252146,"Bucknall Primary School",27,1,3.7037037037037035E-2,0,0,1,3.7037037037037035E-2,6,0.22222222222222221,19,0.70370370370370372,0.92531576057111475,"At risk of persistent absence",9252146,"Primary",9252146,"Bucknall Primary School",31,2,6.4516129032258063E-2,2,6.4516129032258063E-2,3,9.6774193548387094E-2,5,0.16129032258064516,19,0.61290322580645162,0.89934762348555453,"Persistent absence"]
[null,null,"Primary",9252146,"Bucknall Primary School",40,2,0.05,0,0,8,0.2,4,0.1,26,0.65,0.91643192488262915,"At risk of persistent absence",null,"Primary",9252149,"The Donington-on-Bain School",79,0,0,1,1.2658227848101266E-2,6,7.5949367088607597E-2,22,0.27848101265822783,50,0.63291139240506333,0.9593773728170083,"As expected",9252149,"Primary",9252149,"The Donington-on-Bain School",79,0,0,0,0,9,0.11392405063291139,13,0.16455696202531644,57,0.72151898734177211,0.96773840769903763,"As expected"]
[null,null,"Primary",9252149,"The Donington-on-Bain School",94,1,1.0638297872340425E-2,7,7.4468085106382975E-2,9,9.5744680851063829E-2,9,9.5744680851063829E-2,68,0.72340425531914898,0.94129235618597318,"At risk of persistent absence",null,"Primary",9252151,"Faldingworth Community Primary",62,2,3.2258064516129031E-2,6,9.6774193548387094E-2,5,8.0645161290322578E-2,12,0.19354838709677419,37,0.59677419354838712,0.92540322580645162,"At risk of persistent absence",9252151,"Primary",9252151,"Faldingworth Community Primary",64,2,3.125E-2,2,3.125E-2,13,0.203125,19,0.296875,28,0.4375,0.920891364902507,"At risk of persistent absence"]
[null,null,"Primary",9252151,"Faldingworth Community Primary",73,0,0,3,4.1095890410958902E-2,9,0.12328767123287671,7,9.5890410958904104E-2,54,0.73972602739726023,0.95814307458143078,"As expected",null,"Primary",9252152,"Frithville Primary School",34,0,0,0,0,10,0.29411764705882354,6,0.17647058823529413,18,0.52941176470588236,0.93328763993602926,"At risk of persistent absence",9252152,"Primary",9252152,"Frithville Primary School",34,0,0,1,2.9411764705882353E-2,9,0.26470588235294118,4,0.11764705882352941,20,0.58823529411764708,0.94143222506393864,"At risk of persistent absence"]
[null,null,"Primary",9252152,"Frithville Primary School",38,0,0,4,0.10526315789473684,5,0.13157894736842105,1,2.6315789473684209E-2,28,0.73684210526315785,0.94616336633663367,"At risk of persistent absence",null,"Primary",9252153,"Fulstow Community Primary School",35,0,0,0,0,6,0.17142857142857143,12,0.34285714285714286,17,0.48571428571428571,0.94404711821623899,"At risk of persistent absence",9252153,"Primary",9252153,"Fulstow Community Primary School",35,1,2.8571428571428571E-2,2,5.7142857142857141E-2,4,0.11428571428571428,9,0.25714285714285712,19,0.54285714285714282,0.92185166749626679,"At risk of persistent absence"]
[null,null,"Primary",9252153,"Fulstow Community Primary School",35,0,0,0,0,5,0.14285714285714285,3,8.5714285714285715E-2,27,0.77142857142857146,0.97513227513227518,"As expected",null,"Primary",9252157,"Gipsey Bridge Academy",87,1,1.1494252873563218E-2,3,3.4482758620689655E-2,18,0.20689655172413793,19,0.21839080459770116,46,0.52873563218390807,0.93207968401167784,"At risk of persistent absence",9252157,"Primary",9252157,"Gipsey Bridge Academy",86,0,0,1,1.1627906976744186E-2,13,0.15116279069767441,29,0.33720930232558138,43,0.5,0.94527614808820559,"At risk of persistent absence"]
[null,null,"Primary",9252157,"Gipsey Bridge Academy",96,0,0,4,4.1666666666666664E-2,14,0.14583333333333334,17,0.17708333333333334,61,0.63541666666666663,0.95671583850931674,"As expected",null,"Primary",9252158,"Grainthorpe School",42,0,0,0,0,2,4.7619047619047616E-2,10,0.23809523809523808,30,0.7142857142857143,0.9656637168141593,"As expected",9252158,"Primary",9252158,"Grainthorpe School",42,0,0,0,0,4,9.5238095238095233E-2,14,0.33333333333333331,24,0.5714285714285714,0.95736754966887416,"As expected"]
[null,null,"Primary",9252158,"Grainthorpe School",43,0,0,3,6.9767441860465115E-2,4,9.3023255813953487E-2,3,6.9767441860465115E-2,33,0.76744186046511631,0.95726872246696038,"As expected",null,"Primary",9252159,"Great Steeping Primary School",87,0,0,1,1.1494252873563218E-2,15,0.17241379310344829,15,0.17241379310344829,56,0.64367816091954022,0.94811279826464212,"At risk of persistent absence",9252159,"Primary",9252159,"Great Steeping Primary School",88,0,0,5,5.6818181818181816E-2,19,0.21590909090909091,24,0.27272727272727271,40,0.45454545454545453,0.9334789515488483,"At risk of persistent absence"]
[null,null,"Primary",9252159,"Great Steeping Primary School",101,2,1.9801980198019802E-2,10,9.9009900990099015E-2,12,0.11881188118811881,6,5.9405940594059403E-2,71,0.70297029702970293,0.94313612866168872,"At risk of persistent absence",null,"Primary",9252161,"Hogsthorpe Community Primary Academy",55,0,0,8,0.14545454545454545,16,0.29090909090909089,5,9.0909090909090912E-2,26,0.47272727272727272,0.91098825155494123,"At risk of persistent absence",9252161,"Primary",9252161,"Hogsthorpe Community Primary Academy",54,0,0,1,1.8518518518518517E-2,8,0.14814814814814814,9,0.16666666666666666,36,0.66666666666666663,0.95304264494489699,"As expected"]
[null,null,"Primary",9252161,"Hogsthorpe Community Primary Academy",59,2,3.3898305084745763E-2,8,0.13559322033898305,10,0.16949152542372881,4,6.7796610169491525E-2,35,0.59322033898305082,0.91752900595798059,"At risk of persistent absence",null,"Primary",9252162,"HOLTON LE CLAY INFANTS SCHOOL",63,0,0,2,3.1746031746031744E-2,14,0.22222222222222221,16,0.25396825396825395,31,0.49206349206349204,0.93351313320825513,"At risk of persistent absence",9252162,"Primary",9252162,"HOLTON LE CLAY INFANTS SCHOOL",66,0,0,3,4.5454545454545456E-2,5,7.575757575757576E-2,16,0.24242424242424243,42,0.63636363636363635,0.95300906842539157,"As expected"]
[null,null,"Primary",9252162,"HOLTON LE CLAY INFANTS SCHOOL",87,0,0,8,9.1954022988505746E-2,17,0.19540229885057472,10,0.11494252873563218,52,0.5977011494252874,0.93571732652192419,"At risk of persistent absence",null,"Primary",9252166,"Ingham Primary School",72,0,0,0,0,7,9.7222222222222224E-2,9,0.125,56,0.77777777777777779,0.96919481623114512,"As expected",9252166,"Primary",9252166,"Ingham Primary School",73,0,0,1,1.3698630136986301E-2,1,1.3698630136986301E-2,13,0.17808219178082191,58,0.79452054794520544,0.97483221476510062,"As expected"]
[null,null,"Primary",9252166,"Ingham Primary School",88,0,0,2,2.2727272727272728E-2,7,7.9545454545454544E-2,8,9.0909090909090912E-2,71,0.80681818181818177,0.96885521885521886,"As expected",null,"Primary",9252168,"Keelby Primary Academy",156,0,0,2,1.282051282051282E-2,30,0.19230769230769232,26,0.16666666666666666,98,0.62820512820512819,0.95065359477124178,"As expected",9252168,"Primary",9252168,"Keelby Primary Academy",157,0,0,1,6.369426751592357E-3,20,0.12738853503184713,28,0.17834394904458598,108,0.68789808917197448,0.96028273308650292,"As expected"]
[null,null,"Primary",9252168,"Keelby Primary Academy",177,0,0,6,3.3898305084745763E-2,20,0.11299435028248588,9,5.0847457627118647E-2,142,0.80225988700564976,0.96387191910680425,"As expected",null,"Primary",9252169,"Benjamin Murray",41,1,2.4390243902439025E-2,3,7.3170731707317069E-2,13,0.31707317073170732,5,0.12195121951219512,19,0.46341463414634149,0.91423889293517846,"At risk of persistent absence",9252169,"Primary",9252169,"Benjamin Murray",42,0,0,3,7.1428571428571425E-2,10,0.23809523809523808,10,0.23809523809523808,19,0.45238095238095238,0.91886326194398682,"At risk of persistent absence"]
[null,null,"Primary",9252169,"Legsby Primary School",49,0,0,8,0.16326530612244897,15,0.30612244897959184,5,0.10204081632653061,21,0.42857142857142855,0.89916603487490521,"Persistent absence",null,"Primary",9252170,"Eastfield Infants and Nursery Academy",164,2,1.2195121951219513E-2,17,0.10365853658536585,45,0.27439024390243905,29,0.17682926829268292,71,0.43292682926829268,0.90730134283101505,"Persistent absence",9252170,"Primary",9252170,"Eastfield Infants and Nursery Academy",162,5,3.0864197530864196E-2,16,9.8765432098765427E-2,47,0.29012345679012347,24,0.14814814814814814,70,0.43209876543209874,0.90485316498506285,"Persistent absence"]
[null,null,"Primary",9252170,"Eastfield Infants and Nursery Academy",235,2,8.5106382978723406E-3,37,0.1574468085106383,67,0.28510638297872343,38,0.16170212765957448,91,0.38723404255319149,0.88903434467888498,"Persistent absence",null,"Primary",9252171,"Louth Kidgate Primary Academy",363,1,2.7548209366391185E-3,14,3.8567493112947659E-2,65,0.1790633608815427,63,0.17355371900826447,220,0.60606060606060608,0.94170574071727287,"At risk of persistent absence",9252171,"Primary",9252171,"Louth Kidgate Primary Academy",361,2,5.5401662049861496E-3,13,3.6011080332409975E-2,51,0.14127423822714683,74,0.20498614958448755,221,0.61218836565096957,0.94804238335075552,"At risk of persistent absence"]
[null,null,"Primary",9252171,"Louth Kidgate Primary Academy",421,6,1.4251781472684086E-2,14,3.3254156769596199E-2,75,0.17814726840855108,60,0.14251781472684086,266,0.63182897862232779,0.93960884503567965,"At risk of persistent absence",null,"Primary",9252174,"Marshchapel Primary School",22,0,0,1,4.5454545454545456E-2,6,0.27272727272727271,3,0.13636363636363635,12,0.54545454545454541,0.93934316353887404,"At risk of persistent absence",9252174,"Primary",9252174,"Marshchapel Primary School",22,0,0,1,4.5454545454545456E-2,9,0.40909090909090912,4,0.18181818181818182,8,0.36363636363636365,0.91026645768025083,"At risk of persistent absence"]
[null,null,"Primary",9252174,"Marshchapel Primary School",29,0,0,3,0.10344827586206896,3,0.10344827586206896,4,0.13793103448275862,19,0.65517241379310343,0.93693107932379716,"At risk of persistent absence",null,"Primary",9252175,"The Marton Academy",67,0,0,0,0,4,5.9701492537313432E-2,17,0.2537313432835821,46,0.68656716417910446,0.96674794945688314,"As expected",9252175,"Primary",9252175,"The Marton Academy",71,0,0,1,1.4084507042253521E-2,5,7.0422535211267609E-2,14,0.19718309859154928,51,0.71830985915492962,0.96644803229061549,"As expected"]
[null,null,"Primary",9252175,"The Marton Academy",69,0,0,6,8.6956521739130432E-2,6,8.6956521739130432E-2,4,5.7971014492753624E-2,53,0.76811594202898548,0.95431632010081913,"As expected",null,"Primary",9252176,"Middle Rasen Primary School",114,0,0,9,7.8947368421052627E-2,19,0.16666666666666666,20,0.17543859649122806,66,0.57894736842105265,0.93581365253963122,"At risk of persistent absence",9252176,"Primary",9252176,"Middle Rasen Primary School",114,1,8.771929824561403E-3,5,4.3859649122807015E-2,13,0.11403508771929824,29,0.25438596491228072,66,0.57894736842105265,0.9390835988469125,"At risk of persistent absence"]
[null,null,"Primary",9252176,"Middle Rasen Primary School",126,3,2.3809523809523808E-2,6,4.7619047619047616E-2,20,0.15873015873015872,15,0.11904761904761904,82,0.65079365079365081,0.93106995884773658,"At risk of persistent absence",null,"Primary",9252177,"Morton Trentside Primary School",175,0,0,5,2.8571428571428571E-2,30,0.17142857142857143,49,0.28000000000000003,91,0.52,0.94076133447390931,"At risk of persistent absence",9252177,"Primary",9252177,"Morton Trentside Primary School",171,1,5.8479532163742687E-3,6,3.5087719298245612E-2,19,0.1111111111111111,42,0.24561403508771928,103,0.60233918128654973,0.94803535843850595,"At risk of persistent absence"]
[null,null,"Primary",9252177,"Morton Trentside Primary School",202,3,1.4851485148514851E-2,13,6.4356435643564358E-2,36,0.17821782178217821,25,0.12376237623762376,125,0.61881188118811881,0.93578995854444957,"At risk of persistent absence",null,"Primary",9252178,"Nettleton Community Primary School",68,0,0,5,7.3529411764705885E-2,7,0.10294117647058823,12,0.17647058823529413,44,0.6470588235294118,0.94748382852757373,"At risk of persistent absence",9252178,"Primary",9252178,"Nettleton Community Primary School",69,1,1.4492753623188406E-2,4,5.7971014492753624E-2,9,0.13043478260869565,19,0.27536231884057971,36,0.52173913043478259,0.93421052631578949,"At risk of persistent absence"]
[null,null,"Primary",9252178,"Nettleton Community Primary School",77,0,0,3,3.896103896103896E-2,10,0.12987012987012986,7,9.0909090909090912E-2,57,0.74025974025974028,0.95476419634263721,"As expected",null,"Primary",9252179,"New Leake Primary School",32,0,0,1,3.125E-2,4,0.125,5,0.15625,22,0.6875,0.95865816206000476,"As expected",9252179,"Primary",9252179,"New Leake Primary School",32,0,0,1,3.125E-2,5,0.15625,8,0.25,18,0.5625,0.94525745257452576,"At risk of persistent absence"]
[null,null,"Primary",9252179,"New Leake Primary School",47,0,0,1,2.1276595744680851E-2,4,8.5106382978723402E-2,11,0.23404255319148937,31,0.65957446808510634,0.96425702811244984,"As expected",null,"Primary",9252180,"New York Primary School",37,0,0,2,5.4054054054054057E-2,4,0.10810810810810811,12,0.32432432432432434,19,0.51351351351351349,0.9387057877813505,"At risk of persistent absence",9252180,"Primary",9252180,"New York Primary School",39,0,0,1,2.564102564102564E-2,9,0.23076923076923078,5,0.12820512820512819,24,0.61538461538461542,0.94334619093539052,"At risk of persistent absence"]
[null,null,"Primary",9252180,"New York Primary School",46,0,0,2,4.3478260869565216E-2,14,0.30434782608695654,3,6.5217391304347824E-2,27,0.58695652173913049,0.93800322061191621,"At risk of persistent absence",null,"Primary",9252181,"Normanby-by-Spital Primary School",45,0,0,1,2.2222222222222223E-2,11,0.24444444444444444,12,0.26666666666666666,21,0.46666666666666667,0.94075193017791203,"At risk of persistent absence",9252181,"Primary",9252181,"Normanby-by-Spital Primary School",46,0,0,0,0,10,0.21739130434782608,9,0.19565217391304349,27,0.58695652173913049,0.94908116385911179,"At risk of persistent absence"]
[null,null,"Primary",9252181,"Normanby-by-Spital Primary School",53,0,0,6,0.11320754716981132,9,0.16981132075471697,6,0.11320754716981132,32,0.60377358490566035,0.92732354996505939,"At risk of persistent absence",null,"Primary",9252182,"Kelsey Primary School",92,0,0,0,0,3,3.2608695652173912E-2,17,0.18478260869565216,72,0.78260869565217395,0.96932219723739155,"As expected",9252182,"Primary",9252182,"Kelsey Primary School",93,0,0,1,1.0752688172043012E-2,9,9.6774193548387094E-2,18,0.19354838709677419,65,0.69892473118279574,0.96367362146050672,"As expected"]
[null,null,"Primary",9252182,"Kelsey Primary School",103,0,0,1,9.7087378640776691E-3,11,0.10679611650485436,14,0.13592233009708737,77,0.74757281553398058,0.97132486388384753,"As expected",null,"Primary",9252183,"North Thoresby Primary Academy",85,0,0,7,8.2352941176470587E-2,17,0.2,18,0.21176470588235294,43,0.50588235294117645,0.9266169154228856,"At risk of persistent absence",9252183,"Primary",9252183,"North Thoresby Primary Academy",84,0,0,3,3.5714285714285712E-2,19,0.22619047619047619,17,0.20238095238095238,45,0.5357142857142857,0.93921127911728652,"At risk of persistent absence"]
[null,null,"Primary",9252183,"North Thoresby Primary Academy",95,0,0,2,2.1052631578947368E-2,13,0.1368421052631579,11,0.11578947368421053,69,0.72631578947368425,0.95966785290628709,"As expected",null,"Primary",9252185,"Osgodby Primary School",70,0,0,0,0,9,0.12857142857142856,10,0.14285714285714285,51,0.72857142857142854,0.96323053698511973,"As expected",9252185,"Primary",9252185,"Osgodby Primary School",74,0,0,0,0,11,0.14864864864864866,15,0.20270270270270271,48,0.64864864864864868,0.95919324577861165,"As expected"]
[null,null,"Primary",9252185,"Osgodby Primary School",81,0,0,1,1.2345679012345678E-2,8,9.8765432098765427E-2,11,0.13580246913580246,61,0.75308641975308643,0.96777879341864714,"As expected",null,"Primary",9252187,"Scampton Pollyplatt Primary School",90,0,0,3,3.3333333333333333E-2,7,7.7777777777777779E-2,15,0.16666666666666666,65,0.72222222222222221,0.95966457023060792,"As expected",9252187,"Primary",9252187,"Scampton Pollyplatt Primary School",90,0,0,0,0,8,8.8888888888888892E-2,17,0.18888888888888888,65,0.72222222222222221,0.96673228346456697,"As expected"]
[null,null,"Primary",9252187,"Scampton Pollyplatt Primary School",99,0,0,1,1.0101010101010102E-2,11,0.1111111111111111,11,0.1111111111111111,76,0.76767676767676762,0.96995869320315431,"As expected",null,"Primary",9252188,"Scotter Primary School",253,1,3.952569169960474E-3,8,3.1620553359683792E-2,45,0.17786561264822134,49,0.19367588932806323,150,0.59288537549407117,0.93835736897643329,"At risk of persistent absence",9252188,"Primary",9252188,"Scotter Primary School",252,3,1.1904761904761904E-2,3,1.1904761904761904E-2,14,5.5555555555555552E-2,51,0.20238095238095238,181,0.71825396825396826,0.95494781800020667,"As expected"]
[null,null,"Primary",9252188,"Scotter Primary School",288,2,6.9444444444444441E-3,19,6.5972222222222224E-2,35,0.12152777777777778,29,0.10069444444444445,203,0.70486111111111116,0.94710051546391749,"At risk of persistent absence",null,"Primary",9252190,"Skegness Infant Academy",183,1,5.4644808743169399E-3,22,0.12021857923497267,66,0.36065573770491804,27,0.14754098360655737,67,0.36612021857923499,0.90214158239143372,"Persistent absence",9252190,"Primary",9252190,"Skegness Infant Academy",180,0,0,13,7.2222222222222215E-2,35,0.19444444444444445,32,0.17777777777777778,100,0.55555555555555558,0.93727564708105049,"At risk of persistent absence"]
[null,null,"Primary",9252190,"Skegness Infant Academy",248,3,1.2096774193548387E-2,24,9.6774193548387094E-2,63,0.25403225806451613,42,0.16935483870967741,116,0.46774193548387094,0.91278901734104045,"At risk of persistent absence",null,"Primary",9252191,"Seathorne Primary Academy",205,1,4.8780487804878049E-3,11,5.3658536585365853E-2,49,0.23902439024390243,34,0.16585365853658537,110,0.53658536585365857,0.9286726852197269,"At risk of persistent absence",9252191,"Primary",9252191,"Seathorne Primary Academy",205,3,1.4634146341463415E-2,6,2.9268292682926831E-2,35,0.17073170731707318,48,0.23414634146341465,113,0.551219512195122,0.93912814665380229,"At risk of persistent absence"]
[null,null,"Primary",9252191,"Seathorne Primary Academy",266,2,7.5187969924812026E-3,15,5.6390977443609019E-2,46,0.17293233082706766,44,0.16541353383458646,159,0.59774436090225569,0.93894367148453328,"At risk of persistent absence",null,"Primary",9252193,"Spilsby Primary Academy",195,1,5.1282051282051282E-3,9,4.6153846153846156E-2,38,0.19487179487179487,51,0.26153846153846155,96,0.49230769230769234,0.93252608331429443,"At risk of persistent absence",9252193,"Primary",9252193,"Spilsby Primary Academy",199,2,1.0050251256281407E-2,13,6.5326633165829151E-2,62,0.31155778894472363,38,0.19095477386934673,84,0.42211055276381909,0.91688144329896903,"At risk of persistent absence"]
[null,null,"Primary",9252193,"Spilsby Primary Academy",229,2,8.7336244541484712E-3,20,8.7336244541484712E-2,44,0.19213973799126638,23,0.10043668122270742,139,0.60698689956331875,0.93129213026882152,"At risk of persistent absence",null,"Primary",9252195,"STURTON BY STOW PRIMARY SCHOOL",154,0,0,6,3.896103896103896E-2,28,0.18181818181818182,44,0.2857142857142857,76,0.4935064935064935,0.93950177935943058,"At risk of persistent absence",9252195,"Primary",9252195,"STURTON BY STOW PRIMARY SCHOOL",154,0,0,3,1.948051948051948E-2,26,0.16883116883116883,31,0.20129870129870131,94,0.61038961038961037,0.95125679347826086,"As expected"]
[null,null,"Primary",9252195,"STURTON BY STOW PRIMARY SCHOOL",175,0,0,11,6.2857142857142861E-2,15,8.5714285714285715E-2,12,6.8571428571428575E-2,137,0.78285714285714281,0.9631008081667376,"As expected",null,"Primary",9252196,"Sutton-on-Sea CP School",146,0,0,5,3.4246575342465752E-2,33,0.22602739726027396,36,0.24657534246575341,72,0.49315068493150682,0.93458371454711797,"At risk of persistent absence",9252196,"Primary",9252196,"Sutton-on-Sea CP School",147,2,1.3605442176870748E-2,8,5.4421768707482991E-2,30,0.20408163265306123,31,0.21088435374149661,76,0.51700680272108845,0.93353377686796313,"At risk of persistent absence"]
[null,null,"Primary",9252196,"Sutton-on-Sea CP School",172,1,5.8139534883720929E-3,7,4.0697674418604654E-2,37,0.21511627906976744,18,0.10465116279069768,109,0.63372093023255816,0.94042183083278974,"At risk of persistent absence",null,"Primary",9252197,"Tealby School",66,1,1.5151515151515152E-2,2,3.0303030303030304E-2,12,0.18181818181818182,18,0.27272727272727271,33,0.5,0.93303779748016802,"At risk of persistent absence",9252197,"Primary",9252197,"Tealby School",68,0,0,3,4.4117647058823532E-2,13,0.19117647058823528,17,0.25,35,0.51470588235294112,0.93533638145003262,"At risk of persistent absence"]
[null,null,"Primary",9252197,"Tealby School",76,0,0,6,7.8947368421052627E-2,7,9.2105263157894732E-2,13,0.17105263157894737,50,0.65789473684210531,0.94558823529411762,"At risk of persistent absence",null,"Primary",9252198,"Edward Richardson Primary School",95,0,0,0,0,3,3.1578947368421054E-2,18,0.18947368421052632,74,0.77894736842105261,0.96894262683736365,"As expected",9252198,"Primary",9252198,"Edward Richardson Primary School",95,0,0,2,2.1052631578947368E-2,13,0.1368421052631579,19,0.2,61,0.64210526315789473,0.9557239364615665,"As expected"]
[null,null,"Primary",9252198,"Edward Richardson Primary School",97,0,0,5,5.1546391752577317E-2,10,0.10309278350515463,13,0.13402061855670103,69,0.71134020618556704,0.95317278287461771,"As expected",null,"Primary",9252199,"Tetney Primary School",95,1,1.0526315789473684E-2,1,1.0526315789473684E-2,12,0.12631578947368421,18,0.18947368421052632,63,0.66315789473684206,0.94514767932489452,"At risk of persistent absence",9252199,"Primary",9252199,"Tetney Primary School",98,1,1.020408163265306E-2,2,2.0408163265306121E-2,17,0.17346938775510204,11,0.11224489795918367,67,0.68367346938775508,0.94260065288356909,"At risk of persistent absence"]
[null,null,"Primary",9252199,"Tetney Primary School",101,0,0,10,9.9009900990099015E-2,21,0.20792079207920791,13,0.12871287128712872,57,0.5643564356435643,0.92959295929592956,"At risk of persistent absence",null,"Primary",9252201,"Toynton All Saints Primary School",130,0,0,1,7.6923076923076927E-3,23,0.17692307692307693,30,0.23076923076923078,76,0.58461538461538465,0.94805269186712482,"At risk of persistent absence",9252201,"Primary",9252201,"Toynton All Saints Primary School",127,0,0,1,7.874015748031496E-3,15,0.11811023622047244,34,0.26771653543307089,77,0.60629921259842523,0.95711929631665749,"As expected"]
[null,null,"Primary",9252201,"Toynton All Saints Primary School",147,0,0,4,2.7210884353741496E-2,18,0.12244897959183673,14,9.5238095238095233E-2,111,0.75510204081632648,0.95924804441079992,"As expected",null,"Primary",9252202,"Utterby Primary Academy",57,0,0,3,5.2631578947368418E-2,11,0.19298245614035087,14,0.24561403508771928,29,0.50877192982456143,0.93605990783410142,"At risk of persistent absence",9252202,"Primary",9252202,"Utterby Primary Academy",55,0,0,1,1.8181818181818181E-2,8,0.14545454545454545,7,0.12727272727272726,39,0.70909090909090911,0.96132939897499614,"As expected"]
[null,null,"Primary",9252202,"Utterby Primary Academy",67,0,0,2,2.9850746268656716E-2,9,0.13432835820895522,7,0.1044776119402985,49,0.73134328358208955,0.96363131593559137,"As expected",null,"Primary",9252203,"Waddingham Primary School",66,0,0,1,1.5151515151515152E-2,10,0.15151515151515152,15,0.22727272727272727,40,0.60606060606060608,0.94865181711606095,"At risk of persistent absence",9252203,"Primary",9252203,"Waddingham Primary School",63,0,0,2,3.1746031746031744E-2,10,0.15873015873015872,10,0.15873015873015872,41,0.65079365079365081,0.95794263651406508,"As expected"]
[null,null,"Primary",9252203,"Waddingham Primary School",74,0,0,3,4.0540540540540543E-2,11,0.14864864864864866,5,6.7567567567567571E-2,55,0.7432432432432432,0.95846153846153848,"As expected",null,"Primary",9252205,"Willoughton School",45,0,0,3,6.6666666666666666E-2,10,0.22222222222222221,10,0.22222222222222221,22,0.48888888888888887,0.93244398837010434,"At risk of persistent absence",9252205,"Primary",9252205,"Willoughton School",44,0,0,2,4.5454545454545456E-2,3,6.8181818181818177E-2,11,0.25,28,0.63636363636363635,0.95297805642633227,"As expected"]
[null,null,"Primary",9252205,"Willoughton School",52,0,0,2,3.8461538461538464E-2,7,0.13461538461538461,6,0.11538461538461539,37,0.71153846153846156,0.95690883190883191,"As expected",null,"Primary",9252206,"Wragby Primary School",162,0,0,4,2.4691358024691357E-2,33,0.20370370370370369,36,0.22222222222222221,89,0.54938271604938271,0.94233223924142961,"At risk of persistent absence",9252206,"Primary",9252206,"Wragby Primary School",162,0,0,8,4.9382716049382713E-2,21,0.12962962962962962,33,0.20370370370370369,100,0.61728395061728392,0.94465341214400855,"At risk of persistent absence"]
[null,null,"Primary",9252206,"Wragby Primary School",191,2,1.0471204188481676E-2,16,8.3769633507853408E-2,30,0.15706806282722513,22,0.11518324607329843,121,0.63350785340314131,0.92999026290165532,"At risk of persistent absence",null,"Primary",9252207,"Gainsborough White's Wood Academy",209,3,1.4354066985645933E-2,12,5.7416267942583733E-2,33,0.15789473684210525,31,0.14832535885167464,130,0.62200956937799046,0.93742740998838558,"At risk of persistent absence",9252207,"Primary",9252207,"Gainsborough White's Wood Academy",209,3,1.4354066985645933E-2,9,4.3062200956937802E-2,40,0.19138755980861244,39,0.18660287081339713,118,0.56459330143540665,0.9422523721609205,"At risk of persistent absence"]
[null,null,"Primary",9252207,"Gainsborough White's Wood Academy",219,2,9.1324200913242004E-3,14,6.3926940639269403E-2,41,0.18721461187214611,24,0.1095890410958904,138,0.63013698630136983,0.93748925193465171,"At risk of persistent absence",null,"Primary",9252208,"Hillcrest Early Years Academy",121,2,1.6528925619834711E-2,12,9.9173553719008267E-2,27,0.2231404958677686,16,0.13223140495867769,64,0.52892561983471076,0.91343570057581569,"At risk of persistent absence",{"$f":"AL145*1","v":9252208},"Primary",9252208,"Hillcrest Early Years Academy",116,1,8.6206896551724137E-3,9,7.7586206896551727E-2,25,0.21551724137931033,27,0.23275862068965517,54,0.46551724137931033,0.92700453857791221,"At risk of persistent absence"]
[null,null,"Primary",9252208,"Hillcrest Early Years Academy",159,1,6.2893081761006293E-3,15,9.4339622641509441E-2,31,0.19496855345911951,14,8.8050314465408799E-2,98,0.61635220125786161,0.9329896907216495,"At risk of persistent absence",null,"Primary",9252210,"Hemswell Cliff Primary School",36,0,0,1,2.7777777777777776E-2,5,0.1388888888888889,11,0.30555555555555558,19,0.52777777777777779,0.94054500412881914,"At risk of persistent absence",9252210,"Primary",9252210,"Hemswell Cliff Primary School",36,0,0,2,5.5555555555555552E-2,8,0.22222222222222221,11,0.30555555555555558,15,0.41666666666666669,0.93706467661691539,"At risk of persistent absence"]
[null,null,"Primary",9252210,"Hemswell Cliff Primary School",44,0,0,7,0.15909090909090909,5,0.11363636363636363,4,9.0909090909090912E-2,28,0.63636363636363635,0.92297979797979801,"At risk of persistent absence",null,"Primary",9252214,"Gainsborough Charles Baines Primary",176,0,0,15,8.5227272727272721E-2,45,0.25568181818181818,31,0.17613636363636365,85,0.48295454545454547,0.92177247550063912,"At risk of persistent absence",9252214,"Primary",9252214,"Gainsborough Charles Baines Primary",178,2,1.1235955056179775E-2,12,6.741573033707865E-2,32,0.1797752808988764,33,0.1853932584269663,99,0.5561797752808989,0.93195794485221184,"At risk of persistent absence"]
[null,null,"Primary",9252214,"Gainsborough Charles Baines Primary",202,1,4.9504950495049506E-3,22,0.10891089108910891,40,0.19801980198019803,20,9.9009900990099015E-2,119,0.58910891089108908,0.92954378219278877,"At risk of persistent absence",null,"Primary",9252215,"Tattershall Primary School",115,0,0,6,5.2173913043478258E-2,11,9.5652173913043481E-2,26,0.22608695652173913,72,0.62608695652173918,0.95264045672765019,"As expected",9252215,"Primary",9252215,"Tattershall Primary School",119,0,0,2,1.680672268907563E-2,10,8.4033613445378158E-2,26,0.21848739495798319,81,0.68067226890756305,0.95884923525127463,"As expected"]
[null,null,"Primary",9252215,"Tattershall Primary School",140,1,7.1428571428571426E-3,5,3.5714285714285712E-2,16,0.11428571428571428,10,7.1428571428571425E-2,108,0.77142857142857146,0.96019300361881788,"As expected",null,"Primary",9252219,"THE RICHMOND SCHOOL",351,0,0,25,7.1225071225071226E-2,103,0.29344729344729342,56,0.15954415954415954,167,0.4757834757834758,0.91994759253193581,"At risk of persistent absence",9252219,"Primary",9252219,"THE RICHMOND SCHOOL",348,3,8.6206896551724137E-3,22,6.3218390804597707E-2,76,0.21839080459770116,69,0.19827586206896552,178,0.5114942528735632,0.92940084769142028,"At risk of persistent absence"]
[null,null,"Primary",9252219,"THE RICHMOND SCHOOL",407,8,1.9656019656019656E-2,78,0.19164619164619165,110,0.27027027027027029,90,0.22113022113022113,121,0.29729729729729731,0.87594418128280627,"Persistent absence",null,"Primary",9252224,"Ruskington Winchelsea Primary School",192,1,5.208333333333333E-3,4,2.0833333333333332E-2,23,0.11979166666666667,47,0.24479166666666666,117,0.609375,0.94723873591989982,"At risk of persistent absence",9252224,"Primary",9252224,"Ruskington Winchelsea Primary School",194,0,0,3,1.5463917525773196E-2,24,0.12371134020618557,38,0.19587628865979381,129,0.66494845360824739,0.95630760889210198,"As expected"]
[null,null,"Primary",9252224,"Ruskington Winchelsea Primary School",220,0,0,12,5.4545454545454543E-2,24,0.10909090909090909,25,0.11363636363636363,159,0.72272727272727277,0.95549162294804535,"As expected",null,"Primary",9252229,"Holton-Le-Clay Junior School",122,0,0,1,8.1967213114754103E-3,21,0.1721311475409836,30,0.24590163934426229,70,0.57377049180327866,0.95044610561851939,"As expected",9252229,"Primary",9252229,"Holton-Le-Clay Junior School",126,0,0,1,7.9365079365079361E-3,17,0.13492063492063491,25,0.1984126984126984,83,0.65873015873015872,0.95890119250425898,"As expected"]
[null,null,"Primary",9252229,"Holton-Le-Clay Junior School",126,0,0,5,3.968253968253968E-2,19,0.15079365079365079,17,0.13492063492063491,85,0.67460317460317465,0.95240220139818532,"As expected",null,"Primary",9252234,"Carlton Road Academy",389,13,3.3419023136246784E-2,47,0.12082262210796915,118,0.30334190231362468,70,0.17994858611825193,141,0.36246786632390743,0.89533510481251843,"Persistent absence",9252234,"Primary",9252234,"Carlton Road Academy",378,7,1.8518518518518517E-2,39,0.10317460317460317,76,0.20105820105820105,80,0.21164021164021163,176,0.46560846560846558,0.91903035473093053,"At risk of persistent absence"]
[null,null,"Primary",9252234,"Carlton Road Academy",429,13,3.0303030303030304E-2,38,8.8578088578088576E-2,61,0.14219114219114218,60,0.13986013986013987,257,0.5990675990675991,0.91924325247693883,"At risk of persistent absence",null,"Primary",9252237,"Park Academy",329,14,4.2553191489361701E-2,30,9.1185410334346503E-2,67,0.20364741641337386,63,0.19148936170212766,155,0.47112462006079026,0.91152616093130356,"At risk of persistent absence",9252237,"Primary",9252237,"Park Academy",326,8,2.4539877300613498E-2,31,9.5092024539877307E-2,74,0.22699386503067484,77,0.2361963190184049,136,0.41717791411042943,0.91002834390606024,"At risk of persistent absence"]
[null,null,"Primary",9252237,"Park Academy",366,2,5.4644808743169399E-3,19,5.1912568306010931E-2,69,0.18852459016393441,30,8.1967213114754092E-2,246,0.67213114754098358,0.94426619747464291,"At risk of persistent absence",null,"Primary",9252238,"Sutton Bridge Westmere Community Primary",212,0,0,17,8.0188679245283015E-2,66,0.31132075471698112,38,0.17924528301886791,91,0.42924528301886794,0.90858505564387915,"Persistent absence",9252238,"Primary",9252238,"Sutton Bridge Westmere Community Primary",216,6,2.7777777777777776E-2,21,9.7222222222222224E-2,43,0.19907407407407407,34,0.15740740740740741,112,0.51851851851851849,0.91307602728331394,"At risk of persistent absence"]
[null,null,"Primary",9252238,"Sutton Bridge Westmere Community Primary",231,1,4.329004329004329E-3,17,7.3593073593073599E-2,42,0.18181818181818182,28,0.12121212121212122,142,0.61471861471861466,0.93577537518153941,"At risk of persistent absence",null,"Primary",9252239,"Staniland Academy",506,18,3.5573122529644272E-2,29,5.731225296442688E-2,124,0.24505928853754941,92,0.18181818181818182,243,0.48023715415019763,0.91636831857295398,"At risk of persistent absence",9252239,"Primary",9252239,"Staniland Academy",507,8,1.5779092702169626E-2,28,5.5226824457593686E-2,99,0.19526627218934911,120,0.23668639053254437,252,0.49704142011834318,0.93038449572680859,"At risk of persistent absence"]
[null,null,"Primary",9252239,"Staniland Academy",570,6,1.0526315789473684E-2,52,9.1228070175438603E-2,111,0.19473684210526315,87,0.15263157894736842,314,0.55087719298245619,0.92491942109587311,"At risk of persistent absence",null,"Primary",9252240,"Waddington All Saints Academy",341,3,8.7976539589442824E-3,3,8.7976539589442824E-3,43,0.12609970674486803,77,0.22580645161290322,215,0.63049853372434017,0.94853721902180055,"At risk of persistent absence",9252240,"Primary",9252240,"Waddington All Saints Academy",330,2,6.0606060606060606E-3,10,3.0303030303030304E-2,43,0.13030303030303031,56,0.16969696969696971,219,0.66363636363636369,0.95014614691179278,"As expected"]
[null,null,"Primary",9252240,"Waddington All Saints Academy",390,2,5.1282051282051282E-3,12,3.0769230769230771E-2,38,9.7435897435897437E-2,39,0.1,299,0.76666666666666672,0.96198633432778369,"As expected",null,"Primary",9252241,"Cherry Willingham Primary Academy",177,1,5.6497175141242938E-3,8,4.519774011299435E-2,28,0.15819209039548024,29,0.16384180790960451,111,0.6271186440677966,0.94431343345331187,"At risk of persistent absence",9252241,"Primary",9252241,"Cherry Willingham Primary Academy",175,0,0,3,1.7142857142857144E-2,31,0.17714285714285713,35,0.2,106,0.60571428571428576,0.94938978829389786,"At risk of persistent absence"]
[null,null,"Primary",9252241,"Cherry Willingham Primary Academy",201,0,0,16,7.9601990049751242E-2,30,0.14925373134328357,26,0.12935323383084577,129,0.64179104477611937,0.94142780843866836,"At risk of persistent absence",null,"Primary",9252243,"Bythams Primary School",71,1,1.4084507042253521E-2,5,7.0422535211267609E-2,16,0.22535211267605634,17,0.23943661971830985,32,0.45070422535211269,0.91092016532521214,"At risk of persistent absence",9252243,"Primary",9252243,"Bythams Primary School",71,2,2.8169014084507043E-2,3,4.2253521126760563E-2,4,5.6338028169014086E-2,12,0.16901408450704225,50,0.70422535211267601,0.94823263975933814,"At risk of persistent absence"]
[null,null,"Primary",9252243,"Bythams Primary School",84,1,1.1904761904761904E-2,6,7.1428571428571425E-2,9,0.10714285714285714,8,9.5238095238095233E-2,60,0.7142857142857143,0.93386243386243384,"At risk of persistent absence",null,"Primary",9252244,"Horncastle Primary School",373,5,1.3404825737265416E-2,26,6.9705093833780166E-2,49,0.13136729222520108,92,0.24664879356568364,201,0.53887399463806973,0.93337740119784474,"At risk of persistent absence",9252244,"Primary",9252244,"Horncastle Primary School",369,4,1.0840108401084011E-2,22,5.9620596205962058E-2,57,0.15447154471544716,74,0.20054200542005421,212,0.57452574525745259,0.93965390460316678,"At risk of persistent absence"]
[null,null,"Primary",9252244,"Horncastle Primary School",421,5,1.1876484560570071E-2,20,4.7505938242280284E-2,68,0.16152019002375298,41,9.7387173396674589E-2,287,0.68171021377672214,0.94703483733711546,"At risk of persistent absence",null,"Primary",9252245,"Lincoln Birchwood Junior School",259,4,1.5444015444015444E-2,4,1.5444015444015444E-2,47,0.18146718146718147,61,0.23552123552123552,143,0.55212355212355213,0.94335811720625251,"At risk of persistent absence",9252245,"Primary",9252245,"Lincoln Birchwood Junior School",254,0,0,7,2.7559055118110236E-2,32,0.12598425196850394,57,0.22440944881889763,158,0.62204724409448819,0.95099238716693857,"As expected"]
[null,null,"Primary",9252245,"Lincoln Birchwood Junior School",257,5,1.9455252918287938E-2,14,5.4474708171206226E-2,43,0.16731517509727625,25,9.727626459143969E-2,170,0.66147859922178986,0.94163737551259519,"At risk of persistent absence",null,"Primary",9252246,"Lincoln Leslie Manser C P School",210,1,4.7619047619047623E-3,13,6.1904761904761907E-2,35,0.16666666666666666,50,0.23809523809523808,111,0.52857142857142858,0.93346117664085682,"At risk of persistent absence",9252246,"Primary",9252246,"Lincoln Leslie Manser C P School",213,1,4.6948356807511738E-3,9,4.2253521126760563E-2,31,0.14553990610328638,35,0.16431924882629109,137,0.64319248826291076,0.94655484295346159,"At risk of persistent absence"]
[null,null,"Primary",9252246,"Lincoln Leslie Manser C P School",248,4,1.6129032258064516E-2,11,4.4354838709677422E-2,34,0.13709677419354838,25,0.10080645161290322,174,0.70161290322580649,0.94728195937873361,"At risk of persistent absence",null,"Primary",9252247,"Gainsborough Benjamin Adlard School",187,5,2.6737967914438502E-2,6,3.2085561497326207E-2,38,0.20320855614973263,35,0.18716577540106952,103,0.55080213903743314,0.93166758114210946,"At risk of persistent absence",9252247,"Primary",9252247,"Gainsborough Benjamin Adlard School",182,2,1.098901098901099E-2,6,3.2967032967032968E-2,32,0.17582417582417584,43,0.23626373626373626,99,0.54395604395604391,0.93912626020163226,"At risk of persistent absence"]
[null,null,"Primary",9252247,"Gainsborough Benjamin Adlard School",210,2,9.5238095238095247E-3,15,7.1428571428571425E-2,29,0.1380952380952381,19,9.0476190476190474E-2,145,0.69047619047619047,0.9385918475383801,"At risk of persistent absence",null,"Primary",9252248,"Sleaford St Botolph's CE Primary School",346,2,5.7803468208092483E-3,12,3.4682080924855488E-2,55,0.15895953757225434,58,0.16763005780346821,219,0.63294797687861271,0.94367898362709135,"At risk of persistent absence",9252248,"Primary",9252248,"Sleaford St Botolph's CE Primary School",348,0,0,7,2.0114942528735632E-2,37,0.10632183908045977,38,0.10919540229885058,266,0.76436781609195403,0.96025129877975113,"As expected"]
[null,null,"Primary",9252248,"Sleaford St Botolph's CE Primary School",404,0,0,18,4.4554455445544552E-2,51,0.12623762376237624,58,0.14356435643564355,277,0.6856435643564357,0.95613873258924453,"As expected",null,"Primary",9253000,"Allington with Sedgebrook CE Primary",96,0,0,1,1.0416666666666666E-2,12,0.125,17,0.17708333333333334,66,0.6875,0.95940563725490191,"As expected",9253000,"Primary",9253000,"Allington with Sedgebrook CE Primary",95,0,0,2,2.1052631578947368E-2,12,0.12631578947368421,18,0.18947368421052632,63,0.66315789473684206,0.95737704918032784,"As expected"]
[null,null,"Primary",9253000,"Allington with Sedgebrook CE Primary",112,0,0,2,1.7857142857142856E-2,5,4.4642857142857144E-2,15,0.13392857142857142,90,0.8035714285714286,0.97496811224489799,"As expected",null,"Primary",9253001,"Ancaster CE Primary",160,0,0,2,1.2500000000000001E-2,33,0.20624999999999999,37,0.23125000000000001,88,0.55000000000000004,0.9457965629354389,"At risk of persistent absence",9253001,"Primary",9253001,"Ancaster CE Primary",163,1,6.1349693251533744E-3,0,0,27,0.16564417177914109,32,0.19631901840490798,103,0.63190184049079756,0.95076409814894536,"As expected"]
[null,null,"Primary",9253001,"Ancaster CE Primary",191,0,0,14,7.3298429319371722E-2,35,0.18324607329842932,25,0.13089005235602094,117,0.61256544502617805,0.93606036536934079,"At risk of persistent absence",null,"Primary",9253004,"Barrowby Church of England Primary",205,0,0,0,0,8,3.9024390243902439E-2,35,0.17073170731707318,162,0.79024390243902443,0.97031024531024535,"As expected",9253004,"Primary",9253004,"Barrowby Church of England Primary",203,0,0,1,4.9261083743842365E-3,11,5.4187192118226604E-2,25,0.12315270935960591,166,0.81773399014778325,0.97558029165588056,"As expected"]
[null,null,"Primary",9253004,"Barrowby Church of England Primary",231,0,0,3,1.2987012987012988E-2,23,9.9567099567099568E-2,26,0.11255411255411256,179,0.77489177489177485,0.96901589340183014,"As expected",null,"Primary",9253005,"Baston C.E. Primary",162,1,6.1728395061728392E-3,2,1.2345679012345678E-2,17,0.10493827160493827,38,0.23456790123456789,104,0.64197530864197527,0.95111357545513353,"As expected",9253005,"Primary",9253005,"Baston C.E. Primary",162,0,0,6,3.7037037037037035E-2,26,0.16049382716049382,31,0.19135802469135801,99,0.61111111111111116,0.94894229704286193,"At risk of persistent absence"]
[null,null,"Primary",9253005,"Baston C.E. Primary",189,0,0,5,2.6455026455026454E-2,14,7.407407407407407E-2,24,0.12698412698412698,146,0.77248677248677244,0.96943620178041545,"As expected",null,"Primary",9253007,"BILLINGHAY C E PRIMARY SCHOOL",156,1,6.41025641025641E-3,7,4.4871794871794872E-2,35,0.22435897435897437,37,0.23717948717948717,76,0.48717948717948717,0.93057520612772604,"At risk of persistent absence",9253007,"Primary",9253007,"BILLINGHAY C E PRIMARY SCHOOL",148,0,0,13,8.7837837837837843E-2,36,0.24324324324324326,45,0.30405405405405406,54,0.36486486486486486,0.91784818250773093,"At risk of persistent absence"]
[null,null,"Primary",9253007,"BILLINGHAY C E PRIMARY SCHOOL",159,0,0,6,3.7735849056603772E-2,15,9.4339622641509441E-2,19,0.11949685534591195,119,0.74842767295597479,0.95795481015606798,"As expected",null,"Primary",9253009,"Branston Church of England Infant Academy",90,0,0,1,1.1111111111111112E-2,9,0.1,19,0.21111111111111111,61,0.67777777777777781,0.95563725490196083,"As expected",9253009,"Primary",9253009,"Branston Church of England Infant Academy",90,0,0,2,2.2222222222222223E-2,11,0.12222222222222222,19,0.21111111111111111,58,0.64444444444444449,0.95399373531714959,"As expected"]
[null,null,"Primary",9253009,"Branston Church of England Infant Academy",132,0,0,14,0.10606060606060606,17,0.12878787878787878,11,8.3333333333333329E-2,90,0.68181818181818177,0.94205948372615034,"At risk of persistent absence",null,"Primary",9253015,"Coleby CE Controlled Primary School",42,0,0,1,2.3809523809523808E-2,2,4.7619047619047616E-2,3,7.1428571428571425E-2,36,0.8571428571428571,0.9759733426867766,"As expected",9253015,"Primary",9253015,"Coleby CE Controlled Primary School",42,0,0,2,4.7619047619047616E-2,1,2.3809523809523808E-2,6,0.14285714285714285,33,0.7857142857142857,0.96493837654058645,"As expected"]
[null,null,"Primary",9253015,"Coleby CE Controlled Primary School",57,0,0,4,7.0175438596491224E-2,22,0.38596491228070173,2,3.5087719298245612E-2,29,0.50877192982456143,0.92252604166666663,"At risk of persistent absence",null,"Primary",9253017,"DENTON C.E. SCHOOL",53,2,3.7735849056603772E-2,0,0,13,0.24528301886792453,8,0.15094339622641509,30,0.56603773584905659,0.94959617110379901,"At risk of persistent absence",9253017,"Primary",9253017,"DENTON C.E. SCHOOL",53,0,0,0,0,10,0.18867924528301888,7,0.13207547169811321,36,0.67924528301886788,0.95590421139554083,"As expected"]
[null,null,"Primary",9253017,"DENTON C.E. SCHOOL",65,1,1.5384615384615385E-2,5,7.6923076923076927E-2,7,0.1076923076923077,4,6.1538461538461542E-2,47,0.72307692307692306,0.94057377049180324,"At risk of persistent absence",null,"Primary",9253018,"Digby Church of England School",55,0,0,2,3.6363636363636362E-2,13,0.23636363636363636,9,0.16363636363636364,31,0.5636363636363636,0.94253812636165579,"At risk of persistent absence",9253018,"Primary",9253018,"Digby Church of England School",56,0,0,1,1.7857142857142856E-2,15,0.26785714285714285,16,0.2857142857142857,24,0.42857142857142855,0.93307210031347965,"At risk of persistent absence"]
[null,null,"Primary",9253018,"Digby Church of England School",60,4,6.6666666666666666E-2,2,3.3333333333333333E-2,10,0.16666666666666666,2,3.3333333333333333E-2,42,0.7,0.90704314720812185,"Persistent absence",null,"Primary",9253021,"Dunston St Peter's Church of England Primary School",63,0,0,4,6.3492063492063489E-2,13,0.20634920634920634,14,0.22222222222222221,32,0.50793650793650791,0.93827160493827155,"At risk of persistent absence",9253021,"Primary",9253021,"Dunston St Peter's Church of England Primary School",63,0,0,2,3.1746031746031744E-2,17,0.26984126984126983,14,0.22222222222222221,30,0.47619047619047616,0.93081411503195333,"At risk of persistent absence"]
[null,null,"Primary",9253021,"Dunston St Peter's Church of England Primary School",71,0,0,0,0,15,0.21126760563380281,6,8.4507042253521125E-2,50,0.70422535211267601,0.95699208443271766,"As expected",null,"Primary",9253022,"The Edenham Church of England School",91,0,0,3,3.2967032967032968E-2,12,0.13186813186813187,19,0.2087912087912088,57,0.62637362637362637,0.95529086828931464,"As expected",9253022,"Primary",9253022,"The Edenham Church of England School",93,0,0,1,1.0752688172043012E-2,20,0.21505376344086022,20,0.21505376344086022,52,0.55913978494623651,0.94452931067404999,"At risk of persistent absence"]
[null,null,"Primary",9253022,"The Edenham Church of England School",94,1,1.0638297872340425E-2,8,8.5106382978723402E-2,13,0.13829787234042554,7,7.4468085106382975E-2,65,0.69148936170212771,0.93857888398233646,"At risk of persistent absence",null,"Primary",9253026,"Grantham St Anne's CofE Primary School",184,0,0,6,3.2608695652173912E-2,24,0.13043478260869565,32,0.17391304347826086,122,0.66304347826086951,0.95200520621491902,"As expected",9253026,"Primary",9253026,"Grantham St Anne's CofE Primary School",183,0,0,3,1.6393442622950821E-2,25,0.13661202185792351,41,0.22404371584699453,114,0.62295081967213117,0.95482043403111194,"As expected"]
[null,null,"Primary",9253026,"Grantham St Anne's CofE Primary School",213,0,0,12,5.6338028169014086E-2,25,0.11737089201877934,24,0.11267605633802817,152,0.71361502347417838,0.95240190040471584,"As expected",null,"Primary",9253029,"Grantham Gonerby Hill Foot Church of England Primary",272,1,3.6764705882352941E-3,9,3.3088235294117647E-2,34,0.125,44,0.16176470588235295,184,0.67647058823529416,0.95126641393330036,"As expected",9253029,"Primary",9253029,"Grantham Gonerby Hill Foot Church of England Primary",272,1,3.6764705882352941E-3,3,1.1029411764705883E-2,26,9.5588235294117641E-2,65,0.23897058823529413,177,0.65073529411764708,0.95594225567830027,"As expected"]
[null,null,"Primary",9253029,"Grantham Gonerby Hill Foot Church of England Primary",317,1,3.1545741324921135E-3,21,6.6246056782334389E-2,42,0.13249211356466878,34,0.10725552050473186,219,0.69085173501577291,0.94853370720878605,"At risk of persistent absence",null,"Primary",9253031,"Harlaxton CE Primary",172,1,5.8139534883720929E-3,3,1.7441860465116279E-2,33,0.19186046511627908,42,0.2441860465116279,93,0.54069767441860461,0.94366259909147587,"At risk of persistent absence",9253031,"Primary",9253031,"Harlaxton CE Primary",168,0,0,2,1.1904761904761904E-2,21,0.125,41,0.24404761904761904,104,0.61904761904761907,0.95736072206660439,"As expected"]
[null,null,"Primary",9253031,"Harlaxton CE Primary",207,3,1.4492753623188406E-2,5,2.4154589371980676E-2,27,0.13043478260869565,18,8.6956521739130432E-2,154,0.7439613526570048,0.96034921789741723,"As expected",null,"Primary",9253033,"Heckington St Andrew's CofE Primary School",154,0,0,8,5.1948051948051951E-2,27,0.17532467532467533,27,0.17532467532467533,92,0.59740259740259738,0.94323441991911516,"At risk of persistent absence",9253033,"Primary",9253033,"Heckington St Andrew's CofE Primary School",155,0,0,6,3.870967741935484E-2,36,0.23225806451612904,26,0.16774193548387098,87,0.56129032258064515,0.93904250457038396,"At risk of persistent absence"]
[null,null,"Primary",9253033,"Heckington St Andrew's CofE Primary School",173,0,0,9,5.2023121387283239E-2,19,0.10982658959537572,20,0.11560693641618497,125,0.7225433526011561,0.9514500537056928,"As expected",null,"Primary",9253036,"Kirkby la Thorpe Primary Academy",104,0,0,4,3.8461538461538464E-2,11,0.10576923076923077,21,0.20192307692307693,68,0.65384615384615385,0.95649643532664053,"As expected",9253036,"Primary",9253036,"Kirkby la Thorpe Primary Academy",105,1,9.5238095238095247E-3,1,9.5238095238095247E-3,13,0.12380952380952381,16,0.15238095238095239,74,0.70476190476190481,0.95459098497495831,"As expected"]
[null,null,"Primary",9253036,"Kirkby la Thorpe Primary Academy",124,0,0,5,4.0322580645161289E-2,12,9.6774193548387094E-2,10,8.0645161290322578E-2,97,0.782258064516129,0.96414641464146411,"As expected",null,"Primary",9253037,"LEASINGHAM ST. ANDREW'S C.E. PRIMARY",183,1,5.4644808743169399E-3,5,2.7322404371584699E-2,16,8.7431693989071038E-2,46,0.25136612021857924,115,0.62841530054644812,0.95239069082580063,"As expected",9253037,"Primary",9253037,"LEASINGHAM ST. ANDREW'S C.E. PRIMARY",183,1,5.4644808743169399E-3,2,1.092896174863388E-2,19,0.10382513661202186,46,0.25136612021857924,115,0.62841530054644812,0.95350710900473934,"As expected"]
[null,null,"Primary",9253037,"LEASINGHAM ST. ANDREW'S C.E. PRIMARY",207,1,4.830917874396135E-3,8,3.864734299516908E-2,19,9.1787439613526575E-2,33,0.15942028985507245,146,0.70531400966183577,0.95866141732283461,"As expected",null,"Primary",9253040,"Long Bennington Church of England Academy",241,1,4.1493775933609959E-3,5,2.0746887966804978E-2,17,7.0539419087136929E-2,47,0.19502074688796681,171,0.70954356846473032,0.95876193409300892,"As expected",9253040,"Primary",9253040,"Long Bennington Church of England Academy",237,2,8.4388185654008432E-3,6,2.5316455696202531E-2,17,7.1729957805907171E-2,45,0.189873417721519,167,0.70464135021097052,0.95639577526771302,"As expected"]
[null,null,"Primary",9253040,"Long Bennington Church of England Academy",279,0,0,8,2.8673835125448029E-2,32,0.11469534050179211,31,0.1111111111111111,208,0.74551971326164879,0.96304926764314247,"As expected",null,"Primary",9253041,"MARTIN MRS.MARY KING'S CE.PRIMARY SCHOOL",96,1,1.0416666666666666E-2,3,3.125E-2,19,0.19791666666666666,16,0.16666666666666666,57,0.59375,0.93841911764705888,"At risk of persistent absence",9253041,"Primary",9253041,"MARTIN MRS.MARY KING'S CE.PRIMARY SCHOOL",94,1,1.0638297872340425E-2,3,3.1914893617021274E-2,9,9.5744680851063829E-2,15,0.15957446808510639,66,0.7021276595744681,0.95003714710252596,"As expected"]
[null,null,"Primary",9253041,"MARTIN MRS.MARY KING'S CE.PRIMARY SCHOOL",104,0,0,1,9.6153846153846159E-3,7,6.7307692307692304E-2,14,0.13461538461538461,82,0.78846153846153844,0.96728637826242403,"As expected",null,"Primary",9253044,"The Morton Church of England (Controlled) Primary School",165,2,1.2121212121212121E-2,8,4.8484848484848485E-2,25,0.15151515151515152,32,0.19393939393939394,98,0.59393939393939399,0.93838797186077516,"At risk of persistent absence",9253044,"Primary",9253044,"The Morton Church of England (Controlled) Primary School",167,1,5.9880239520958087E-3,5,2.9940119760479042E-2,21,0.12574850299401197,29,0.17365269461077845,111,0.66467065868263475,0.95314158352791345,"As expected"]
[null,null,"Primary",9253044,"The Morton Church of England (Controlled) Primary School",161,1,6.2111801242236021E-3,13,8.0745341614906832E-2,24,0.14906832298136646,20,0.12422360248447205,103,0.63975155279503104,0.93780346820809246,"At risk of persistent absence",null,"Primary",9253045,"Navenby Church of England Primary School",168,0,0,4,2.3809523809523808E-2,14,8.3333333333333329E-2,31,0.18452380952380953,119,0.70833333333333337,0.95855240098142303,"As expected",9253045,"Primary",9253045,"Navenby Church of England Primary School",169,0,0,5,2.9585798816568046E-2,21,0.1242603550295858,43,0.25443786982248523,100,0.59171597633136097,0.95053586150041225,"As expected"]
[null,null,"Primary",9253045,"Navenby Church of England Primary School",197,0,0,7,3.553299492385787E-2,17,8.6294416243654817E-2,16,8.1218274111675121E-2,157,0.79695431472081213,0.96264584117425667,"As expected",null,"Primary",9253047,"North Hykeham All Saints CE Primary",173,2,1.1560693641618497E-2,8,4.6242774566473986E-2,32,0.18497109826589594,28,0.16184971098265896,103,0.59537572254335258,0.9362332531776022,"At risk of persistent absence",9253047,"Primary",9253047,"North Hykeham All Saints CE Primary",175,2,1.1428571428571429E-2,6,3.4285714285714287E-2,21,0.12,43,0.24571428571428572,103,0.58857142857142852,0.94422730006013234,"At risk of persistent absence"]
[null,null,"Primary",9253047,"North Hykeham All Saints CE Primary",202,6,2.9702970297029702E-2,11,5.4455445544554455E-2,17,8.4158415841584164E-2,24,0.11881188118811881,144,0.71287128712871284,0.94209456963428151,"At risk of persistent absence",null,"Primary",9253050,"Potterhanworth C.E. Primary School",111,0,0,1,9.0090090090090089E-3,18,0.16216216216216217,23,0.2072072072072072,69,0.6216216216216216,0.95297930031082601,"As expected",9253050,"Primary",9253050,"Potterhanworth C.E. Primary School",112,1,8.9285714285714281E-3,2,1.7857142857142856E-2,17,0.15178571428571427,36,0.32142857142857145,56,0.5,0.93914062499999995,"At risk of persistent absence"]
[null,null,"Primary",9253050,"Potterhanworth C.E. Primary School",125,0,0,3,2.4E-2,24,0.192,12,9.6000000000000002E-2,86,0.68799999999999994,0.95049209662988365,"As expected",null,"Primary",9253052,"Ropsley Church of England Primary",98,0,0,0,0,9,9.1836734693877556E-2,18,0.18367346938775511,71,0.72448979591836737,0.96421036769138035,"As expected",9253052,"Primary",9253052,"Ropsley Church of England Primary",97,0,0,1,1.0309278350515464E-2,14,0.14432989690721648,24,0.24742268041237114,58,0.59793814432989689,0.94858566091442809,"At risk of persistent absence"]
[null,null,"Primary",9253052,"Ropsley Church of England Primary",112,0,0,1,8.9285714285714281E-3,11,9.8214285714285712E-2,9,8.0357142857142863E-2,91,0.8125,0.96924603174603174,"As expected",null,"Primary",9253056,"Saint Lawrence Church of England Primary School",179,0,0,4,2.23463687150838E-2,17,9.4972067039106142E-2,34,0.18994413407821228,124,0.69273743016759781,0.95700834228132481,"As expected",9253056,"Primary",9253056,"Saint Lawrence Church of England Primary School",180,1,5.5555555555555558E-3,2,1.1111111111111112E-2,27,0.15,49,0.2722222222222222,101,0.56111111111111112,0.94678103221404553,"At risk of persistent absence"]
[null,null,"Primary",9253056,"Saint Lawrence Church of England Primary School",202,2,9.9009900990099011E-3,18,8.9108910891089105E-2,30,0.14851485148514851,25,0.12376237623762376,127,0.62871287128712872,0.93215988265493221,"At risk of persistent absence",null,"Primary",9253066,"Swinderby All Saints CE Primary School",71,0,0,1,1.4084507042253521E-2,10,0.14084507042253522,12,0.16901408450704225,48,0.676056338028169,0.95395729997843437,"As expected",9253066,"Primary",9253066,"Swinderby All Saints CE Primary School",73,0,0,2,2.7397260273972601E-2,5,6.8493150684931503E-2,13,0.17808219178082191,53,0.72602739726027399,0.96235011990407671,"As expected"]
[null,null,"Primary",9253066,"Swinderby All Saints CE Primary School",77,0,0,4,5.1948051948051951E-2,10,0.12987012987012986,7,9.0909090909090912E-2,56,0.72727272727272729,0.95141895141895139,"As expected",null,"Primary",9253068,"ST. MICHAEL'S CE PRIMARY SCHOOL",168,1,5.9523809523809521E-3,3,1.7857142857142856E-2,23,0.13690476190476192,43,0.25595238095238093,98,0.58333333333333337,0.94454957532016015,"At risk of persistent absence",9253068,"Primary",9253068,"ST. MICHAEL'S CE PRIMARY SCHOOL",168,1,5.9523809523809521E-3,3,1.7857142857142856E-2,17,0.10119047619047619,34,0.20238095238095238,113,0.67261904761904767,0.95217842323651447,"As expected"]
[null,null,"Primary",9253068,"ST. MICHAEL'S CE PRIMARY SCHOOL",197,2,1.015228426395939E-2,16,8.1218274111675121E-2,24,0.12182741116751269,16,8.1218274111675121E-2,139,0.70558375634517767,0.94312393887945667,"At risk of persistent absence",null,"Primary",9253070,"The Uffington Church of England Primary School",77,0,0,1,1.2987012987012988E-2,10,0.12987012987012986,18,0.23376623376623376,48,0.62337662337662336,0.95756858101440689,"As expected",9253070,"Primary",9253070,"The Uffington Church of England Primary School",80,0,0,1,1.2500000000000001E-2,15,0.1875,19,0.23749999999999999,45,0.5625,0.95080831408775979,"As expected"]
[null,null,"Primary",9253070,"The Uffington Church of England Primary School",101,0,0,5,4.9504950495049507E-2,13,0.12871287128712872,6,5.9405940594059403E-2,77,0.76237623762376239,0.95604982206405698,"As expected",null,"Primary",9253071,"WELBOURN CE PRIMARY SCHOOL",51,0,0,3,5.8823529411764705E-2,9,0.17647058823529413,10,0.19607843137254902,29,0.56862745098039214,0.93697604790419164,"At risk of persistent absence",9253071,"Primary",9253071,"WELBOURN CE PRIMARY SCHOOL",52,0,0,2,3.8461538461538464E-2,13,0.25,11,0.21153846153846154,26,0.5,0.94072337575351639,"At risk of persistent absence"]
[null,null,"Primary",9253071,"WELBOURN CE PRIMARY SCHOOL",63,1,1.5873015873015872E-2,7,0.1111111111111111,17,0.26984126984126983,9,0.14285714285714285,29,0.46031746031746029,0.91317188422917894,"At risk of persistent absence",null,"Primary",9253077,"St Gilbert's C of E Primary School",271,3,1.107011070110701E-2,11,4.0590405904059039E-2,59,0.21771217712177121,58,0.2140221402214022,140,0.51660516605166051,0.93189441847676657,"At risk of persistent absence",9253077,"Primary",9253077,"St Gilbert's C of E Primary School",268,2,7.462686567164179E-3,8,2.9850746268656716E-2,24,8.9552238805970144E-2,51,0.19029850746268656,183,0.68283582089552242,0.9556711082222944,"As expected"]
[null,null,"Primary",9253077,"St Gilbert's C of E Primary School",313,1,3.1948881789137379E-3,11,3.5143769968051117E-2,24,7.6677316293929709E-2,28,8.9456869009584661E-2,249,0.79552715654952078,0.96485071963839653,"As expected",null,"Primary",9253078,"Claypole Church of England School",142,0,0,0,0,16,0.11267605633802817,29,0.20422535211267606,97,0.68309859154929575,0.96149992089024838,"As expected",9253078,"Primary",9253078,"Claypole Church of England School",140,0,0,1,7.1428571428571426E-3,17,0.12142857142857143,25,0.17857142857142858,97,0.69285714285714284,0.96169554455445549,"As expected"]
[null,null,"Primary",9253078,"Claypole Church of England School",153,0,0,6,3.9215686274509803E-2,21,0.13725490196078433,23,0.15032679738562091,103,0.67320261437908502,0.95453443258971871,"As expected",null,"Primary",9253085,"St Thomas CofE Primary Academy",353,1,2.8328611898016999E-3,11,3.1161473087818695E-2,59,0.16713881019830029,84,0.23796033994334279,198,0.56090651558073656,0.94095152641586022,"At risk of persistent absence",9253085,"Primary",9253085,"St Thomas CofE Primary Academy",351,2,5.6980056980056983E-3,7,1.9943019943019943E-2,44,0.12535612535612536,69,0.19658119658119658,229,0.6524216524216524,0.95472623127141754,"As expected"]
[null,null,"Primary",9253085,"St Thomas CofE Primary Academy",413,6,1.4527845036319613E-2,20,4.8426150121065374E-2,57,0.13801452784503632,45,0.10895883777239709,284,0.68765133171912829,0.94194194194194192,"At risk of persistent absence",null,"Primary",9253088,"Gedney Hill C of E Primary School",64,2,3.125E-2,2,3.125E-2,20,0.3125,18,0.28125,22,0.34375,0.91823824301742663,"At risk of persistent absence",9253088,"Primary",9253088,"Gedney Hill C of E Primary School",64,1,1.5625E-2,1,1.5625E-2,9,0.140625,20,0.3125,33,0.515625,0.94158415841584153,"At risk of persistent absence"]
[null,null,"Primary",9253088,"Gedney Hill C of E Primary School",71,2,2.8169014084507043E-2,3,4.2253521126760563E-2,9,0.12676056338028169,12,0.16901408450704225,45,0.63380281690140849,0.94226750261233017,"At risk of persistent absence",null,"Primary",9253089,"Holbeach St Marks CE Primary School",34,0,0,2,5.8823529411764705E-2,3,8.8235294117647065E-2,6,0.17647058823529413,23,0.67647058823529416,0.9526967285587975,"As expected",9253089,"Primary",9253089,"Holbeach St Marks CE Primary School",35,0,0,2,5.7142857142857141E-2,10,0.2857142857142857,10,0.2857142857142857,13,0.37142857142857144,0.92461781760674755,"At risk of persistent absence"]
[null,null,"Primary",9253089,"Holbeach St Marks CE Primary School",38,0,0,1,2.6315789473684209E-2,7,0.18421052631578946,0,0,30,0.78947368421052633,0.9519136408243376,"As expected",null,"Primary",9253091,"Pinchbeck East C of E Primary Academy",350,1,2.8571428571428571E-3,13,3.7142857142857144E-2,60,0.17142857142857143,80,0.22857142857142856,196,0.56000000000000005,0.94370706471037236,"At risk of persistent absence",9253091,"Primary",9253091,"Pinchbeck East C of E Primary Academy",350,0,0,7,0.02,36,0.10285714285714286,60,0.17142857142857143,247,0.70571428571428574,0.96131336176966575,"As expected"]
[null,null,"Primary",9253091,"Pinchbeck East C of E Primary Academy",400,0,0,17,4.2500000000000003E-2,42,0.105,37,9.2499999999999999E-2,304,0.76,0.96243631310792033,"As expected",null,"Primary",9253092,"St Bartholomews CE Primary School",89,0,0,8,8.98876404494382E-2,24,0.2696629213483146,19,0.21348314606741572,38,0.42696629213483145,0.91569841404461028,"At risk of persistent absence",9253092,"Primary",9253092,"St Bartholomews CE Primary School",94,2,2.1276595744680851E-2,5,5.3191489361702128E-2,11,0.11702127659574468,19,0.20212765957446807,57,0.6063829787234043,0.93150557620817842,"At risk of persistent absence"]
[null,null,"Primary",9253092,"St Bartholomews CE Primary School",100,1,0.01,7,7.0000000000000007E-2,15,0.15,7,7.0000000000000007E-2,70,0.7,0.94986707178123808,"At risk of persistent absence",null,"Primary",9253093,"Quadring Cowley and  Brown's  Primary School",92,0,0,1,1.0869565217391304E-2,11,0.11956521739130435,26,0.28260869565217389,54,0.58695652173913049,0.9543781014887146,"As expected",9253093,"Primary",9253093,"Quadring Cowley and  Brown's  Primary School",94,0,0,3,3.1914893617021274E-2,14,0.14893617021276595,18,0.19148936170212766,59,0.62765957446808507,0.95519880530147472,"As expected"]
[null,null,"Primary",9253093,"Quadring Cowley and  Brown's  Primary School",107,0,0,4,3.7383177570093455E-2,12,0.11214953271028037,14,0.13084112149532709,77,0.71962616822429903,0.95978029766123318,"As expected",null,"Primary",9253096,"Weston Hills C. E. Primary School",116,0,0,3,2.5862068965517241E-2,11,9.4827586206896547E-2,18,0.15517241379310345,84,0.72413793103448276,0.96226909472029343,"As expected",9253096,"Primary",9253096,"Weston Hills C. E. Primary School",116,1,8.6206896551724137E-3,4,3.4482758620689655E-2,20,0.17241379310344829,24,0.20689655172413793,67,0.57758620689655171,0.94938627064706771,"At risk of persistent absence"]
[null,null,"Primary",9253096,"Weston Hills C. E. Primary School",134,1,7.462686567164179E-3,3,2.2388059701492536E-2,5,3.7313432835820892E-2,8,5.9701492537313432E-2,117,0.87313432835820892,0.97486033519553073,"As expected",null,"Primary",9253097,"Whaplode Church of England Primary School",173,2,1.1560693641618497E-2,7,4.046242774566474E-2,34,0.19653179190751446,20,0.11560693641618497,110,0.63583815028901736,0.94071471940324403,"At risk of persistent absence",9253097,"Primary",9253097,"Whaplode Church of England Primary School",177,0,0,2,1.1299435028248588E-2,34,0.19209039548022599,31,0.1751412429378531,110,0.62146892655367236,0.94854417670682734,"At risk of persistent absence"]
[null,null,"Primary",9253097,"Whaplode Church of England Primary School",189,1,5.2910052910052907E-3,13,6.8783068783068779E-2,19,0.10052910052910052,27,0.14285714285714285,129,0.68253968253968256,0.94740973312401888,"At risk of persistent absence",null,"Primary",9253098,"Donington Cowley Endowed Primary School",234,0,0,16,6.8376068376068383E-2,51,0.21794871794871795,63,0.26923076923076922,104,0.44444444444444442,0.92783571108694263,"At risk of persistent absence",9253098,"Primary",9253098,"Donington Cowley Endowed Primary School",237,2,8.4388185654008432E-3,8,3.3755274261603373E-2,35,0.14767932489451477,56,0.23628691983122363,136,0.57383966244725737,0.94438872172071775,"At risk of persistent absence"]
[null,null,"Primary",9253098,"Donington Cowley Endowed Primary School",276,0,0,23,8.3333333333333329E-2,43,0.15579710144927536,38,0.13768115942028986,172,0.62318840579710144,0.94126780530614995,"At risk of persistent absence",null,"Primary",9253102,"Swineshead St Mary's Primary School",232,2,8.6206896551724137E-3,13,5.6034482758620691E-2,48,0.20689655172413793,56,0.2413793103448276,113,0.48706896551724138,0.92425233950657681,"At risk of persistent absence",9253102,"Primary",9253102,"Swineshead St Mary's Primary School",231,4,1.7316017316017316E-2,9,3.896103896103896E-2,30,0.12987012987012986,45,0.19480519480519481,143,0.61904761904761907,0.9452247191011236,"At risk of persistent absence"]
[null,null,"Primary",9253102,"Swineshead St Mary's Primary School",263,0,0,17,6.4638783269961975E-2,48,0.18250950570342206,38,0.14448669201520911,159,0.6045627376425855,0.93890538820534575,"At risk of persistent absence",null,"Primary",9253103,"Sutterton Fourfields C.E. Primary School",140,0,0,5,3.5714285714285712E-2,27,0.19285714285714287,33,0.23571428571428571,75,0.5357142857142857,0.93992165996188859,"At risk of persistent absence",9253103,"Primary",9253103,"Sutterton Fourfields C.E. Primary School",140,0,0,1,7.1428571428571426E-3,20,0.14285714285714285,32,0.22857142857142856,87,0.62142857142857144,0.95344506517690875,"As expected"]
[null,null,"Primary",9253103,"Sutterton Fourfields C.E. Primary School",158,1,6.3291139240506328E-3,6,3.7974683544303799E-2,30,0.189873417721519,13,8.2278481012658222E-2,108,0.68354430379746833,0.94784341303328645,"At risk of persistent absence",null,"Primary",9253105,"The Lincoln St Peter-in-Eastgate Church of England Infants School",59,0,0,0,0,5,8.4745762711864403E-2,12,0.20338983050847459,42,0.71186440677966101,0.96822033898305082,"As expected",9253105,"Primary",9253105,"The Lincoln St Peter-in-Eastgate Church of England Infants School",59,1,1.6949152542372881E-2,0,0,3,5.0847457627118647E-2,20,0.33898305084745761,35,0.59322033898305082,0.94839280448245356,"At risk of persistent absence"]
[null,null,"Primary",9253105,"The Lincoln St Peter-in-Eastgate Church of England Infants School",89,0,0,1,1.1235955056179775E-2,8,8.98876404494382E-2,9,0.10112359550561797,71,0.797752808988764,0.97039059218815626,"As expected",null,"Primary",9253107,"Lincoln St Faith and St Martin CE Junior",354,0,0,4,1.1299435028248588E-2,30,8.4745762711864403E-2,63,0.17796610169491525,257,0.72598870056497178,0.96131792711002995,"As expected",9253107,"Primary",9253107,"Lincoln St Faith and St Martin CE Junior",356,0,0,6,1.6853932584269662E-2,28,7.8651685393258425E-2,63,0.17696629213483145,259,0.72752808988764039,0.96703380755698332,"As expected"]
[null,null,"Primary",9253107,"Lincoln St Faith and St Martin CE Junior",323,1,3.0959752321981426E-3,9,2.7863777089783281E-2,41,0.12693498452012383,30,9.2879256965944276E-2,242,0.74922600619195046,0.96060080878105136,"As expected",null,"Primary",9253108,"The St Faith's Church of England Infant and Nursery School, Lincoln",157,1,6.369426751592357E-3,4,2.5477707006369428E-2,25,0.15923566878980891,32,0.20382165605095542,95,0.60509554140127386,0.94269619269619265,"At risk of persistent absence",9253108,"Primary",9253108,"The St Faith's Church of England Infant and Nursery School, Lincoln",162,4,2.4691358024691357E-2,4,2.4691358024691357E-2,29,0.17901234567901234,24,0.14814814814814814,101,0.62345679012345678,0.93791157102539979,"At risk of persistent absence"]
[null,null,"Primary",9253108,"The St Faith's Church of England Infant and Nursery School, Lincoln",222,0,0,18,8.1081081081081086E-2,25,0.11261261261261261,24,0.10810810810810811,155,0.69819819819819817,0.94688241274144358,"At risk of persistent absence",null,"Primary",9253111,"Lincoln St Peter at Gowts CE Primary",185,0,0,4,2.1621621621621623E-2,32,0.17297297297297298,37,0.2,112,0.60540540540540544,0.94674085850556444,"At risk of persistent absence",{"$f":"AL209*1","v":9253111},"Primary",9253111,"Lincoln St Peter at Gowts CE Primary",189,0,0,4,2.1164021164021163E-2,37,0.19576719576719576,48,0.25396825396825395,100,0.52910052910052907,0.94196180233636195,"At risk of persistent absence"]
[null,null,"Primary",9253111,"Lincoln St Peter at Gowts CE Primary",218,0,0,16,7.3394495412844041E-2,35,0.16055045871559634,19,8.7155963302752298E-2,148,0.67889908256880738,0.94709809964047253,"At risk of persistent absence",null,"Primary",9253116,"Binbrook (C of E) Primary School",77,1,1.2987012987012988E-2,2,2.5974025974025976E-2,9,0.11688311688311688,22,0.2857142857142857,43,0.55844155844155841,0.94441193680514923,"At risk of persistent absence",9253116,"Primary",9253116,"Binbrook (C of E) Primary School",76,5,6.5789473684210523E-2,3,3.9473684210526314E-2,9,0.11842105263157894,11,0.14473684210526316,48,0.63157894736842102,0.93008526187576124,"At risk of persistent absence"]
[null,null,"Primary",9253116,"Binbrook (C of E) Primary School",86,1,1.1627906976744186E-2,8,9.3023255813953487E-2,18,0.20930232558139536,11,0.12790697674418605,48,0.55813953488372092,0.9280792420327304,"At risk of persistent absence",null,"Primary",9253118,"St. Peter and St. Paul C.E.Primary, Burgh-le-Marsh",176,2,1.1363636363636364E-2,7,3.9772727272727272E-2,27,0.15340909090909091,46,0.26136363636363635,94,0.53409090909090906,0.93662891069097642,"At risk of persistent absence",9253118,"Primary",9253118,"St. Peter and St. Paul C.E.Primary, Burgh-le-Marsh",177,1,5.6497175141242938E-3,5,2.8248587570621469E-2,25,0.14124293785310735,41,0.23163841807909605,105,0.59322033898305082,0.94603252833908325,"At risk of persistent absence"]
[null,null,"Primary",9253118,"St. Peter and St. Paul C.E.Primary, Burgh-le-Marsh",208,0,0,23,0.11057692307692307,49,0.23557692307692307,27,0.12980769230769232,108,0.51923076923076927,0.91784373323797608,"At risk of persistent absence",null,"Primary",9253119,"Coningsby St Michael's Church of England Primary School",259,4,1.5444015444015444E-2,13,5.019305019305019E-2,41,0.15830115830115829,65,0.25096525096525096,136,0.52509652509652505,0.93016727441106672,"At risk of persistent absence",9253119,"Primary",9253119,"Coningsby St Michael's Church of England Primary School",263,2,7.6045627376425855E-3,6,2.2813688212927757E-2,32,0.12167300380228137,51,0.19391634980988592,172,0.6539923954372624,0.95254033067809085,"As expected"]
[null,null,"Primary",9253119,"Coningsby St Michael's Church of England Primary School",329,5,1.5197568389057751E-2,12,3.64741641337386E-2,47,0.14285714285714285,41,0.12462006079027356,224,0.68085106382978722,0.94498381877022652,"At risk of persistent absence",null,"Primary",9253120,"Corringham CofE VC Primary School",96,0,0,4,4.1666666666666664E-2,21,0.21875,19,0.19791666666666666,52,0.54166666666666663,0.93155452436194897,"At risk of persistent absence",9253120,"Primary",9253120,"Corringham CofE VC Primary School",95,0,0,2,2.1052631578947368E-2,10,0.10526315789473684,26,0.27368421052631581,57,0.6,0.95535390199637027,"As expected"]
[null,null,"Primary",9253120,"Corringham CofE VC Primary School",109,0,0,5,4.5871559633027525E-2,11,0.10091743119266056,14,0.12844036697247707,79,0.72477064220183485,0.95887942332896459,"As expected",null,"Primary",9253121,"Dunholme St Chad's Church of England Primary School",184,0,0,9,4.8913043478260872E-2,28,0.15217391304347827,38,0.20652173913043478,109,0.59239130434782605,0.94201357651100026,"At risk of persistent absence",9253121,"Primary",9253121,"Dunholme St Chad's Church of England Primary School",180,1,5.5555555555555558E-3,6,3.3333333333333333E-2,19,0.10555555555555556,32,0.17777777777777778,122,0.67777777777777781,0.95379442843419793,"As expected"]
[null,null,"Primary",9253121,"Dunholme St Chad's Church of England Primary School",213,1,4.6948356807511738E-3,9,4.2253521126760563E-2,28,0.13145539906103287,29,0.13615023474178403,146,0.68544600938967137,0.95038501925096253,"As expected",null,"Primary",9253122,"Fiskerton Church of England Primary School",77,0,0,0,0,13,0.16883116883116883,26,0.33766233766233766,38,0.4935064935064935,0.94519490544191431,"At risk of persistent absence",9253122,"Primary",9253122,"Fiskerton Church of England Primary School",74,0,0,1,1.3513513513513514E-2,8,0.10810810810810811,17,0.22972972972972974,48,0.64864864864864868,0.96226636887269312,"As expected"]
[null,null,"Primary",9253122,"Fiskerton Church of England Primary School",87,1,1.1494252873563218E-2,5,5.7471264367816091E-2,19,0.21839080459770116,11,0.12643678160919541,51,0.58620689655172409,0.92734764693125138,"At risk of persistent absence",null,"Primary",9253123,"Grasby All Saints C.E.P. School",66,0,0,4,6.0606060606060608E-2,6,9.0909090909090912E-2,10,0.15151515151515152,46,0.69696969696969702,0.95087144695285997,"As expected",9253123,"Primary",9253123,"Grasby All Saints C.E.P. School",64,0,0,0,0,8,0.125,15,0.234375,41,0.640625,0.96181027453112256,"As expected"]
[null,null,"Primary",9253123,"Grasby All Saints C.E.P. School",77,0,0,1,1.2987012987012988E-2,3,3.896103896103896E-2,2,2.5974025974025976E-2,71,0.92207792207792205,0.98481136697697202,"As expected",null,"Primary",9253124,"Hackthorn C E Primary School",51,0,0,0,0,1,1.9607843137254902E-2,12,0.23529411764705882,38,0.74509803921568629,0.96957900807381781,"As expected",9253124,"Primary",9253124,"Hackthorn C E Primary School",51,0,0,0,0,8,0.15686274509803921,8,0.15686274509803921,35,0.68627450980392157,0.96129141311697097,"As expected"]
[null,null,"Primary",9253124,"Hackthorn C E Primary School",61,0,0,2,3.2786885245901641E-2,12,0.19672131147540983,3,4.9180327868852458E-2,44,0.72131147540983609,0.95225060827250607,"As expected",null,"Primary",9253125,"Halton Holegate  C E Primary School",56,0,0,2,3.5714285714285712E-2,13,0.23214285714285715,8,0.14285714285714285,33,0.5892857142857143,0.94430960086299887,"At risk of persistent absence",9253125,"Primary",9253125,"Halton Holegate  C E Primary School",55,0,0,0,0,16,0.29090909090909089,11,0.2,28,0.50909090909090904,0.9391509433962264,"At risk of persistent absence"]
[null,null,"Primary",9253125,"Halton Holegate  C E Primary School",65,0,0,8,0.12307692307692308,7,0.1076923076923077,8,0.12307692307692308,42,0.64615384615384619,0.93635321100917435,"At risk of persistent absence",null,"Primary",9253128,"Louth St Michael's C of E School",270,0,0,14,5.185185185185185E-2,51,0.18888888888888888,65,0.24074074074074073,140,0.51851851851851849,0.93370545534535854,"At risk of persistent absence",9253128,"Primary",9253128,"Louth St Michael's C of E School",269,0,0,11,4.0892193308550186E-2,41,0.15241635687732341,64,0.23791821561338289,153,0.56877323420074355,0.9447700924840432,"At risk of persistent absence"]
[null,null,"Primary",9253128,"Louth St Michael's C of E School",308,1,3.246753246753247E-3,12,3.896103896103896E-2,46,0.14935064935064934,46,0.14935064935064934,203,0.65909090909090906,0.95152538285300858,"As expected",null,"Primary",9253130,"The Mareham-le-Fen Church of England Primary School",78,0,0,0,0,11,0.14102564102564102,8,0.10256410256410256,59,0.75641025641025639,0.96289284361984095,"As expected",9253130,"Primary",9253130,"The Mareham-le-Fen Church of England Primary School",79,0,0,0,0,8,0.10126582278481013,11,0.13924050632911392,60,0.759493670886076,0.97254945543454097,"As expected"]
[null,null,"Primary",9253130,"The Mareham-le-Fen Church of England Primary School",85,0,0,5,5.8823529411764705E-2,9,0.10588235294117647,6,7.0588235294117646E-2,65,0.76470588235294112,0.95840592334494779,"As expected",null,"Primary",9253131,"MARKET RASEN C.E. PRIMARY SCHOOL",276,2,7.246376811594203E-3,5,1.8115942028985508E-2,35,0.12681159420289856,53,0.19202898550724637,181,0.65579710144927539,0.94798432551398359,"At risk of persistent absence",9253131,"Primary",9253131,"MARKET RASEN C.E. PRIMARY SCHOOL",275,1,3.6363636363636364E-3,3,1.090909090909091E-2,29,0.10545454545454545,72,0.26181818181818184,170,0.61818181818181817,0.95532895567622178,"As expected"]
[null,null,"Primary",9253131,"MARKET RASEN C.E. PRIMARY SCHOOL",304,2,6.5789473684210523E-3,23,7.5657894736842105E-2,51,0.16776315789473684,22,7.2368421052631582E-2,206,0.67763157894736847,0.9431068198484478,"At risk of persistent absence",null,"Primary",9253132,"Newton on Trent Church of England Primary School",50,0,0,0,0,5,0.1,11,0.22,34,0.68,0.96363098758131283,"As expected",9253132,"Primary",9253132,"Newton on Trent Church of England Primary School",51,0,0,1,1.9607843137254902E-2,9,0.17647058823529413,10,0.19607843137254902,31,0.60784313725490191,0.95163861824623563,"As expected"]
[null,null,"Primary",9253132,"Newton on Trent Church of England Primary School",59,0,0,1,1.6949152542372881E-2,10,0.16949152542372881,8,0.13559322033898305,40,0.67796610169491522,0.95804195804195802,"As expected",null,"Primary",9253133,"NORTH COTES C.E. PRIMARY SCHOOL",27,0,0,2,7.407407407407407E-2,4,0.14814814814814814,12,0.44444444444444442,9,0.33333333333333331,0.91721132897603486,"At risk of persistent absence",9253133,"Primary",9253133,"NORTH COTES C.E. PRIMARY SCHOOL",27,0,0,1,3.7037037037037035E-2,8,0.29629629629629628,6,0.22222222222222221,12,0.44444444444444442,0.92145593869731801,"At risk of persistent absence"]
[null,null,"Primary",9253133,"NORTH COTES C.E. PRIMARY SCHOOL",34,0,0,4,0.11764705882352941,14,0.41176470588235292,1,2.9411764705882353E-2,15,0.44117647058823528,0.90521064301552101,"Persistent absence",null,"Primary",9253134,"North Cockerington C.E. Primary School",75,0,0,4,5.3333333333333337E-2,13,0.17333333333333334,14,0.18666666666666668,44,0.58666666666666667,0.93941176470588239,"At risk of persistent absence",9253134,"Primary",9253134,"North Cockerington C.E. Primary School",76,0,0,2,2.6315789473684209E-2,8,0.10526315789473684,19,0.25,47,0.61842105263157898,0.95237548772090885,"As expected"]
[null,null,"Primary",9253134,"North Cockerington C.E. Primary School",85,0,0,2,2.3529411764705882E-2,13,0.15294117647058825,3,3.5294117647058823E-2,67,0.78823529411764703,0.96706192358366272,"As expected",null,"Primary",9253136,"Reepham CE Primary School",169,0,0,1,5.9171597633136093E-3,14,8.2840236686390539E-2,37,0.21893491124260356,117,0.69230769230769229,0.96419248172641836,"As expected",9253136,"Primary",9253136,"Reepham CE Primary School",172,1,5.8139534883720929E-3,2,1.1627906976744186E-2,17,9.8837209302325577E-2,32,0.18604651162790697,120,0.69767441860465118,0.95814565514449113,"As expected"]
[null,null,"Primary",9253136,"Reepham CE Primary School",196,0,0,8,4.0816326530612242E-2,31,0.15816326530612246,23,0.11734693877551021,134,0.68367346938775508,0.95256095256095252,"As expected",null,"Primary",9253139,"Saxilby Church of England Primary School",323,2,6.1919504643962852E-3,9,2.7863777089783281E-2,50,0.15479876160990713,69,0.21362229102167182,193,0.5975232198142415,0.94352068159956026,"At risk of persistent absence",9253139,"Primary",9253139,"Saxilby Church of England Primary School",323,4,1.238390092879257E-2,6,1.8575851393188854E-2,49,0.15170278637770898,63,0.19504643962848298,201,0.62229102167182659,0.93979968935782765,"At risk of persistent absence"]
[null,null,"Primary",9253139,"Saxilby Church of England Primary School",357,1,2.8011204481792717E-3,13,3.6414565826330535E-2,55,0.15406162464985995,37,0.10364145658263306,251,0.70308123249299714,0.95565939771547248,"As expected",null,"Primary",9253140,"Scamblesby CE Primary",57,0,0,2,3.5087719298245612E-2,7,0.12280701754385964,13,0.22807017543859648,35,0.61403508771929827,0.95388412574694725,"As expected",9253140,"Primary",9253140,"Scamblesby CE Primary",56,0,0,2,3.5714285714285712E-2,6,0.10714285714285714,9,0.16071428571428573,39,0.6964285714285714,0.95916042954767333,"As expected"]
[null,null,"Primary",9253140,"Scamblesby CE Primary",68,1,1.4705882352941176E-2,1,1.4705882352941176E-2,5,7.3529411764705885E-2,9,0.13235294117647059,52,0.76470588235294112,0.96418656302054417,"As expected",null,"Primary",9253141,"Scampton C of E Primary School",47,0,0,1,2.1276595744680851E-2,8,0.1702127659574468,16,0.34042553191489361,22,0.46808510638297873,0.93610579987253029,"At risk of persistent absence",9253141,"Primary",9253141,"Scampton C of E Primary School",46,0,0,3,6.5217391304347824E-2,7,0.15217391304347827,9,0.19565217391304349,27,0.58695652173913049,0.93801965230536655,"At risk of persistent absence"]
[null,null,"Primary",9253141,"Scampton C of E Primary School",53,0,0,1,1.8867924528301886E-2,11,0.20754716981132076,4,7.5471698113207544E-2,37,0.69811320754716977,0.95662819167541102,"As expected",null,"Primary",9253146,"Holy Trinity CofE Primary School",92,0,0,3,3.2608695652173912E-2,17,0.18478260869565216,26,0.28260869565217389,46,0.5,0.94375311100049775,"At risk of persistent absence",9253146,"Primary",9253146,"Holy Trinity CofE Primary School",82,0,0,4,4.878048780487805E-2,14,0.17073170731707318,15,0.18292682926829268,49,0.59756097560975607,0.94426336375488917,"At risk of persistent absence"]
[null,null,"Primary",9253146,"Holy Trinity CofE Primary School",119,2,1.680672268907563E-2,5,4.2016806722689079E-2,7,5.8823529411764705E-2,18,0.15126050420168066,87,0.73109243697478987,0.9533061736132874,"As expected",null,"Primary",9253151,"St Helena's Church of England Primary School, Willoughby",110,0,0,3,2.7272727272727271E-2,19,0.17272727272727273,21,0.19090909090909092,67,0.60909090909090913,0.94483142936751185,"At risk of persistent absence",9253151,"Primary",9253151,"St Helena's Church of England Primary School, Willoughby",105,0,0,4,3.8095238095238099E-2,22,0.20952380952380953,27,0.25714285714285712,52,0.49523809523809526,0.93571428571428572,"At risk of persistent absence"]
[null,null,"Primary",9253151,"St Helena's Church of England Primary School, Willoughby",127,1,7.874015748031496E-3,10,7.874015748031496E-2,18,0.14173228346456693,19,0.14960629921259844,79,0.62204724409448819,0.93770346256288839,"At risk of persistent absence",null,"Primary",9253152,"St. Margaret's C of E Primary School Withern",61,0,0,3,4.9180327868852458E-2,15,0.24590163934426229,14,0.22950819672131148,29,0.47540983606557374,0.92822619623006286,"At risk of persistent absence",9253152,"Primary",9253152,"St. Margaret's C of E Primary School Withern",61,0,0,4,6.5573770491803282E-2,11,0.18032786885245902,16,0.26229508196721313,30,0.49180327868852458,0.92668200115008625,"At risk of persistent absence"]
[null,null,"Primary",9253152,"St. Margaret's C of E Primary School Withern",73,0,0,2,2.7397260273972601E-2,13,0.17808219178082191,4,5.4794520547945202E-2,54,0.73972602739726023,0.95676500508647,"As expected",null,"Primary",9253154,"Bardney CE and Methodist Primary School",177,0,0,9,5.0847457627118647E-2,40,0.22598870056497175,48,0.2711864406779661,80,0.4519774011299435,0.92915098285236308,"At risk of persistent absence",9253154,"Primary",9253154,"Bardney CE and Methodist Primary School",175,2,1.1428571428571429E-2,6,3.4285714285714287E-2,35,0.2,40,0.22857142857142856,92,0.52571428571428569,0.93334666733336669,"At risk of persistent absence"]
[null,null,"Primary",9253154,"Bardney CE and Methodist Primary School",207,4,1.932367149758454E-2,21,0.10144927536231885,48,0.2318840579710145,34,0.16425120772946861,100,0.48309178743961351,0.91150601328307301,"At risk of persistent absence",null,"Primary",9253156,"Caistor CE and  Methodist Primary School",195,1,5.1282051282051282E-3,7,3.5897435897435895E-2,31,0.15897435897435896,32,0.1641025641025641,124,0.63589743589743586,0.94578336632126359,"At risk of persistent absence",9253156,"Primary",9253156,"Caistor CE and  Methodist Primary School",199,0,0,3,1.507537688442211E-2,46,0.23115577889447236,39,0.19597989949748743,111,0.55778894472361806,0.94263042685151399,"At risk of persistent absence"]
[null,null,"Primary",9253156,"Caistor CE and  Methodist Primary School",238,1,4.2016806722689074E-3,14,5.8823529411764705E-2,34,0.14285714285714285,30,0.12605042016806722,159,0.66806722689075626,0.94398307740520215,"At risk of persistent absence",null,"Primary",9253158,"WELTON ST MARY'S CE PRIMARY ACADEMY",337,2,5.9347181008902079E-3,8,2.3738872403560832E-2,45,0.13353115727002968,69,0.20474777448071216,213,0.63204747774480707,0.94764605910786415,"At risk of persistent absence",9253158,"Primary",9253158,"WELTON ST MARY'S CE PRIMARY ACADEMY",336,1,2.976190476190476E-3,3,8.9285714285714281E-3,41,0.12202380952380952,80,0.23809523809523808,211,0.62797619047619047,0.95542945576476657,"As expected"]
[null,null,"Primary",9253158,"WELTON ST MARY'S CE PRIMARY ACADEMY",379,1,2.6385224274406332E-3,13,3.430079155672823E-2,48,0.12664907651715041,54,0.14248021108179421,263,0.69393139841688656,0.95466640386321078,"As expected",null,"Primary",9253163,"Brant Broughton C.E/Meth. Primary School",86,0,0,7,8.1395348837209308E-2,10,0.11627906976744186,19,0.22093023255813954,50,0.58139534883720934,0.93993027621346203,"At risk of persistent absence",9253163,"Primary",9253163,"Brant Broughton C.E/Meth. Primary School",84,0,0,13,0.15476190476190477,9,0.10714285714285714,22,0.26190476190476192,40,0.47619047619047616,0.91567256273138631,"At risk of persistent absence"]
[null,null,"Primary",9253163,"Brant Broughton C.E/Meth. Primary School",88,2,2.2727272727272728E-2,4,4.5454545454545456E-2,25,0.28409090909090912,12,0.13636363636363635,45,0.51136363636363635,0.92751165748198394,"At risk of persistent absence",null,"Primary",9253166,"Ellison Boulters CE Academy",245,0,0,7,2.8571428571428571E-2,35,0.14285714285714285,47,0.19183673469387755,156,0.63673469387755099,0.95073787347284389,"As expected",9253166,"Primary",9253166,"Ellison Boulters CE Academy",246,0,0,2,8.130081300813009E-3,26,0.10569105691056911,46,0.18699186991869918,172,0.69918699186991873,0.96462546684518358,"As expected"]
[null,null,"Primary",9253166,"Ellison Boulters CE Academy",281,0,0,11,3.9145907473309607E-2,41,0.14590747330960854,40,0.14234875444839859,189,0.67259786476868333,0.95380542686962277,"As expected",null,"Primary",9253167,"WILLIAM STUKELEY CE VA PRIMARY SCHOOL",260,0,0,11,4.230769230769231E-2,54,0.2076923076923077,57,0.21923076923076923,138,0.53076923076923077,0.93511406952267162,"At risk of persistent absence",9253167,"Primary",9253167,"WILLIAM STUKELEY CE VA PRIMARY SCHOOL",261,1,3.8314176245210726E-3,12,4.5977011494252873E-2,31,0.11877394636015326,51,0.19540229885057472,166,0.63601532567049812,0.94682299797389313,"At risk of persistent absence"]
[null,null,"Primary",9253167,"WILLIAM STUKELEY CE VA PRIMARY SCHOOL",297,1,3.3670033670033669E-3,28,9.4276094276094277E-2,42,0.14141414141414141,41,0.13804713804713806,185,0.62289562289562295,0.9355130057803468,"At risk of persistent absence",null,"Primary",9253168,"LEGBOURNE, EAST WOLD C E PRIMARY SCHOOL",97,0,0,2,2.0618556701030927E-2,12,0.12371134020618557,22,0.22680412371134021,61,0.62886597938144329,0.9510321278907341,"As expected",9253168,"Primary",9253168,"LEGBOURNE, EAST WOLD C E PRIMARY SCHOOL",100,0,0,2,0.02,12,0.12,23,0.23,63,0.63,0.95713770077603322,"As expected"]
[null,null,"Primary",9253168,"LEGBOURNE, EAST WOLD C E PRIMARY SCHOOL",113,0,0,6,5.3097345132743362E-2,19,0.16814159292035399,9,7.9646017699115043E-2,79,0.69911504424778759,0.9532183145321832,"As expected",null,"Primary",9253169,"Gainsborough St. George's CE Community Primary School",174,1,5.7471264367816091E-3,13,7.4712643678160925E-2,49,0.28160919540229884,49,0.28160919540229884,62,0.35632183908045978,0.91340903181069599,"At risk of persistent absence",9253169,"Primary",9253169,"Gainsborough St. George's CE Community Primary School",173,1,5.7803468208092483E-3,5,2.8901734104046242E-2,30,0.17341040462427745,43,0.24855491329479767,94,0.54335260115606931,0.94256722475900556,"At risk of persistent absence"]
[null,null,"Primary",9253169,"Gainsborough St. George's CE Community Primary School",189,2,1.0582010582010581E-2,6,3.1746031746031744E-2,26,0.13756613756613756,30,0.15873015873015872,125,0.66137566137566139,0.94926108374384233,"At risk of persistent absence",null,"Primary",9253170,"The Sibsey Free Primary School",152,0,0,1,6.5789473684210523E-3,24,0.15789473684210525,43,0.28289473684210525,84,0.55263157894736847,0.94901731854446392,"At risk of persistent absence",9253170,"Primary",9253170,"The Sibsey Free Primary School",154,0,0,1,6.4935064935064939E-3,21,0.13636363636363635,46,0.29870129870129869,86,0.55844155844155841,0.95074031890660593,"As expected"]
[null,null,"Primary",9253170,"The Sibsey Free Primary School",179,0,0,12,6.7039106145251395E-2,21,0.11731843575418995,12,6.7039106145251395E-2,134,0.74860335195530725,0.95929148539465503,"As expected",null,"Primary",9253171,"Stickney C of E Primary School",127,2,1.5748031496062992E-2,9,7.0866141732283464E-2,20,0.15748031496062992,34,0.26771653543307089,62,0.48818897637795278,0.9256232852200883,"At risk of persistent absence",9253171,"Primary",9253171,"Stickney C of E Primary School",127,2,1.5748031496062992E-2,5,3.937007874015748E-2,21,0.16535433070866143,39,0.30708661417322836,60,0.47244094488188976,0.91976679622431978,"At risk of persistent absence"]
[null,null,"Primary",9253171,"Stickney C of E Primary School",154,6,3.896103896103896E-2,12,7.792207792207792E-2,23,0.14935064935064934,17,0.11038961038961038,96,0.62337662337662336,0.91219985447489693,"At risk of persistent absence",null,"Primary",9253308,"The National Church of England Junior School",291,9,3.0927835051546393E-2,27,9.2783505154639179E-2,57,0.19587628865979381,76,0.2611683848797251,122,0.41924398625429554,0.91244691277360335,"At risk of persistent absence",9253308,"Primary",9253308,"The National Church of England Junior School",281,6,2.1352313167259787E-2,21,7.4733096085409248E-2,54,0.19217081850533807,63,0.22419928825622776,137,0.48754448398576511,0.92291633718171751,"At risk of persistent absence"]
[null,null,"Primary",9253308,"The National Church of England Junior School",356,2,5.6179775280898875E-3,15,4.2134831460674156E-2,56,0.15730337078651685,37,0.10393258426966293,246,0.6910112359550562,0.9481960660565899,"At risk of persistent absence",null,"Primary",9253310,"The Harrowby Church of England Infant School",34,5,0.14705882352941177,5,0.14705882352941177,11,0.3235294117647059,7,0.20588235294117646,6,0.17647058823529413,0.85132275132275137,"Persistent absence",9253310,"Primary",9253310,"The Harrowby Church of England Infant School",30,2,6.6666666666666666E-2,1,3.3333333333333333E-2,10,0.33333333333333331,10,0.33333333333333331,7,0.23333333333333334,0.89013917678412791,"Persistent absence"]
[null,null,"Primary",9253310,"The Harrowby Church of England Infant School",39,0,0,5,0.12820512820512819,7,0.17948717948717949,6,0.15384615384615385,21,0.53846153846153844,0.92564870259481036,"At risk of persistent absence",null,"Primary",9253311,"Little Gonerby Primary Academy",83,1,1.2048192771084338E-2,11,0.13253012048192772,21,0.25301204819277107,18,0.21686746987951808,32,0.38554216867469882,0.89242810338551148,"Persistent absence",9253311,"Primary",9253311,"Little Gonerby Primary Academy",81,3,3.7037037037037035E-2,5,6.1728395061728392E-2,14,0.1728395061728395,17,0.20987654320987653,42,0.51851851851851849,0.92269488231483476,"At risk of persistent absence"]
[null,null,"Primary",9253311,"Little Gonerby Church of England Infant Academy",119,4,3.3613445378151259E-2,13,0.1092436974789916,23,0.19327731092436976,11,9.2436974789915971E-2,68,0.5714285714285714,0.90442671672141406,"Persistent absence",null,"Primary",9253313,"St Sebastian's Church of England Primary School",152,0,0,2,1.3157894736842105E-2,16,0.10526315789473684,30,0.19736842105263158,104,0.68421052631578949,0.95469335436797476,"As expected",9253313,"Primary",9253313,"St Sebastian's Church of England Primary School",147,0,0,3,2.0408163265306121E-2,14,9.5238095238095233E-2,34,0.23129251700680273,96,0.65306122448979587,0.95775321183149087,"As expected"]
[null,null,"Primary",9253313,"St Sebastian's Church of England Primary School",163,0,0,7,4.2944785276073622E-2,26,0.15950920245398773,18,0.11042944785276074,112,0.68711656441717794,0.95111414279217821,"As expected",null,"Primary",9253314,"Great Ponton C/E School",59,1,1.6949152542372881E-2,0,0,11,0.1864406779661017,10,0.16949152542372881,37,0.6271186440677966,0.95897000565930957,"As expected",9253314,"Primary",9253314,"Great Ponton C/E School",57,1,1.7543859649122806E-2,0,0,2,3.5087719298245612E-2,17,0.2982456140350877,37,0.64912280701754388,0.96641674476726025,"As expected"]
[null,null,"Primary",9253314,"Great Ponton C/E School",75,3,0.04,2,2.6666666666666668E-2,5,6.6666666666666666E-2,4,5.3333333333333337E-2,61,0.81333333333333335,0.96149761019649493,"As expected",null,"Primary",9253317,"Brown's Church of England Primary School, Horbling",63,0,0,4,6.3492063492063489E-2,13,0.20634920634920634,16,0.25396825396825395,30,0.47619047619047616,0.93665667166416788,"At risk of persistent absence",9253317,"Primary",9253317,"Brown's Church of England Primary School, Horbling",57,0,0,1,1.7543859649122806E-2,14,0.24561403508771928,16,0.2807017543859649,26,0.45614035087719296,0.94023413431916203,"At risk of persistent absence"]
[null,null,"Primary",9253317,"Brown's Church of England Primary School, Horbling",77,0,0,4,5.1948051948051951E-2,18,0.23376623376623376,7,9.0909090909090912E-2,48,0.62337662337662336,0.94296761720637989,"At risk of persistent absence",null,"Primary",9253319,"Leadenham Church of England Academy",49,0,0,0,0,9,0.18367346938775511,10,0.20408163265306123,30,0.61224489795918369,0.9482382288743374,"At risk of persistent absence",9253319,"Primary",9253319,"Leadenham Church of England Academy",49,0,0,0,0,10,0.20408163265306123,9,0.18367346938775511,30,0.61224489795918369,0.9511844938980617,"As expected"]
[null,null,"Primary",9253319,"Leadenham C of E Primary Academy",62,0,0,3,4.8387096774193547E-2,11,0.17741935483870969,4,6.4516129032258063E-2,44,0.70967741935483875,0.95011947431302268,"As expected",null,"Primary",9253321,"The Marston Thorold's Charity Church of England School",68,0,0,0,0,8,0.11764705882352941,9,0.13235294117647059,51,0.75,0.96446589164290419,"As expected",9253321,"Primary",9253321,"The Marston Thorold's Charity Church of England School",69,0,0,2,2.8985507246376812E-2,4,5.7971014492753624E-2,11,0.15942028985507245,52,0.75362318840579712,0.96654840344652815,"As expected"]
[null,null,"Primary",9253321,"The Marston Thorold's Charity Church of England School",72,0,0,6,8.3333333333333329E-2,4,5.5555555555555552E-2,7,9.7222222222222224E-2,55,0.76388888888888884,0.9519280205655527,"As expected",null,"Primary",9253322,"The St Gilbert of Sempringham Church of England Primary School, Pointon",74,2,2.7027027027027029E-2,3,4.0540540540540543E-2,19,0.25675675675675674,12,0.16216216216216217,38,0.51351351351351349,0.92388345599354771,"At risk of persistent absence",9253322,"Primary",9253322,"The St Gilbert of Sempringham Church of England Primary School, Pointon",76,1,1.3157894736842105E-2,6,7.8947368421052627E-2,14,0.18421052631578946,11,0.14473684210526316,44,0.57894736842105265,0.92682344514742743,"At risk of persistent absence"]
[null,null,"Primary",9253322,"The St Gilbert of Sempringham Church of England Primary School, Pointon",88,2,2.2727272727272728E-2,8,9.0909090909090912E-2,7,7.9545454545454544E-2,6,6.8181818181818177E-2,65,0.73863636363636365,0.93937473595268273,"At risk of persistent absence",null,"Primary",9253325,"Saint George's C.E. Primary School",163,1,6.1349693251533744E-3,6,3.6809815950920248E-2,27,0.16564417177914109,32,0.19631901840490798,97,0.59509202453987731,0.93925795706883786,"At risk of persistent absence",9253325,"Primary",9253325,"Saint George's C.E. Primary School",162,1,6.1728395061728392E-3,8,4.9382716049382713E-2,23,0.1419753086419753,35,0.21604938271604937,95,0.5864197530864198,0.94403105791006148,"At risk of persistent absence"]
[null,null,"Primary",9253325,"Saint George's C.E. Primary School",187,0,0,9,4.8128342245989303E-2,18,9.6256684491978606E-2,17,9.0909090909090912E-2,143,0.76470588235294112,0.9605862547039018,"As expected",null,"Primary",9253330,"The Saint Mary&#039;s Catholic Voluntary Academy",182,2,1.098901098901099E-2,11,6.043956043956044E-2,28,0.15384615384615385,50,0.27472527472527475,91,0.5,0.93616469163567162,"At risk of persistent absence",9253330,"Primary",9253330,"The Saint Mary&#039;s Catholic Voluntary Academy",178,0,0,7,3.9325842696629212E-2,31,0.17415730337078653,39,0.21910112359550563,101,0.56741573033707871,0.94284182828184393,"At risk of persistent absence"]
[null,null,"Primary",9253330,"The Saint Mary&#039;s Catholic Voluntary Academy",203,1,4.9261083743842365E-3,5,2.4630541871921183E-2,23,0.11330049261083744,26,0.12807881773399016,148,0.72906403940886699,0.95931783536585369,"As expected",null,"Primary",9253331,"Our Lady of Good Counsel Catholic Primary School",145,0,0,4,2.7586206896551724E-2,31,0.21379310344827587,24,0.16551724137931034,86,0.59310344827586203,0.94479411137187963,"At risk of persistent absence",9253331,"Primary",9253331,"Our Lady of Good Counsel Catholic Primary School",145,1,6.8965517241379309E-3,4,2.7586206896551724E-2,9,6.2068965517241378E-2,30,0.20689655172413793,101,0.69655172413793098,0.95935159032297679,"As expected"]
[null,null,"Primary",9253331,"Our Lady of Good Counsel Catholic Primary School",160,2,1.2500000000000001E-2,8,0.05,13,8.1250000000000003E-2,20,0.125,117,0.73124999999999996,0.95019920318725104,"As expected",null,"Primary",9253332,"The Saint Augustine's Catholic Voluntary Academy",91,1,1.098901098901099E-2,6,6.5934065934065936E-2,10,0.10989010989010989,25,0.27472527472527475,49,0.53846153846153844,0.93868249054007569,"At risk of persistent absence",9253332,"Primary",9253332,"The Saint Augustine's Catholic Voluntary Academy",86,3,3.4883720930232558E-2,1,1.1627906976744186E-2,12,0.13953488372093023,26,0.30232558139534882,44,0.51162790697674421,0.93840240988885426,"At risk of persistent absence"]
[null,null,"Primary",9253332,"The Saint Augustine's Catholic Voluntary Academy",94,1,1.0638297872340425E-2,2,2.1276595744680851E-2,16,0.1702127659574468,12,0.1276595744680851,63,0.67021276595744683,0.95436268596702856,"As expected",null,"Primary",9253337,"Cowbit St Mary's Endowed Primary School",62,2,3.2258064516129031E-2,3,4.8387096774193547E-2,25,0.40322580645161288,8,0.12903225806451613,24,0.38709677419354838,0.8932317682317682,"Persistent absence",9253337,"Primary",9253337,"Cowbit St Mary's Endowed Primary School",66,1,1.5151515151515152E-2,4,6.0606060606060608E-2,19,0.2878787878787879,13,0.19696969696969696,29,0.43939393939393939,0.91598472449536283,"At risk of persistent absence"]
[null,null,"Primary",9253337,"Cowbit St Mary's Endowed Primary School",70,4,5.7142857142857141E-2,6,8.5714285714285715E-2,4,5.7142857142857141E-2,7,0.1,49,0.7,0.9358974358974359,"At risk of persistent absence",null,"Primary",9253339,"The Spalding St John the Baptist Church of England",377,2,5.3050397877984082E-3,7,1.8567639257294429E-2,73,0.19363395225464192,99,0.2625994694960212,196,0.519893899204244,0.93785332914572861,"At risk of persistent absence",9253339,"Primary",9253339,"The Spalding St John the Baptist Church of England",379,1,2.6385224274406332E-3,7,1.8469656992084433E-2,42,0.11081794195250659,77,0.20316622691292877,252,0.66490765171503963,0.95703832832534352,"As expected"]
[null,null,"Primary",9253339,"The Spalding St John the Baptist Church of England",433,3,6.9284064665127024E-3,20,4.6189376443418015E-2,49,0.11316397228637413,59,0.13625866050808313,302,0.69745958429561206,0.95224815513986616,"As expected",null,"Primary",9253340,"Tydd St Mary C of E Primary School",86,1,1.1627906976744186E-2,5,5.8139534883720929E-2,11,0.12790697674418605,11,0.12790697674418605,58,0.67441860465116277,0.93936279547790336,"At risk of persistent absence",9253340,"Primary",9253340,"Tydd St Mary C of E Primary School",88,2,2.2727272727272728E-2,4,4.5454545454545456E-2,11,0.125,20,0.22727272727272727,51,0.57954545454545459,0.93377350940376147,"At risk of persistent absence"]
[null,null,"Primary",9253340,"Tydd St Mary C of E Primary School",100,1,0.01,3,0.03,10,0.1,9,0.09,77,0.77,0.96263940520446101,"As expected",null,"Primary",9253342,"Boston St Mary's RC Primary School",181,0,0,4,2.2099447513812154E-2,35,0.19337016574585636,34,0.18784530386740331,108,0.59668508287292821,0.94285479361947044,"At risk of persistent absence",9253342,"Primary",9253342,"Boston St Mary's RC Primary School",181,0,0,6,3.3149171270718231E-2,30,0.16574585635359115,27,0.14917127071823205,118,0.65193370165745856,0.95126832441086706,"As expected"]
[null,null,"Primary",9253342,"Boston St Mary's RC Primary School",198,1,5.0505050505050509E-3,11,5.5555555555555552E-2,31,0.15656565656565657,23,0.11616161616161616,132,0.66666666666666663,0.94734852065412611,"At risk of persistent absence",null,"Primary",9253343,"St Norbert's Catholic Voluntary Academy",183,1,5.4644808743169399E-3,6,3.2786885245901641E-2,29,0.15846994535519127,41,0.22404371584699453,106,0.57923497267759561,0.94276910435497119,"At risk of persistent absence",9253343,"Primary",9253343,"St Norbert's Catholic Voluntary Academy",179,3,1.6759776536312849E-2,1,5.5865921787709499E-3,23,0.12849162011173185,28,0.15642458100558659,124,0.69273743016759781,0.95433767266222791,"As expected"]
[null,null,"Primary",9253343,"St Norbert's Catholic Voluntary Academy",209,1,4.7846889952153108E-3,9,4.3062200956937802E-2,28,0.13397129186602871,23,0.11004784688995216,148,0.70813397129186606,0.95338907667674788,"As expected",null,"Primary",9253346,"The Saint Hugh&#039;s Catholic Primary Voluntary Academy, Lincoln",237,1,4.2194092827004216E-3,12,5.0632911392405063E-2,41,0.1729957805907173,44,0.18565400843881857,139,0.5864978902953587,0.9405225835303137,"At risk of persistent absence",9253346,"Primary",9253346,"The Saint Hugh&#039;s Catholic Primary Voluntary Academy, Lincoln",239,3,1.2552301255230125E-2,5,2.0920502092050208E-2,35,0.14644351464435146,48,0.20083682008368201,148,0.61924686192468614,0.95084131894665358,"As expected"]
[null,null,"Primary",9253346,"The Saint Hugh&#039;s Catholic Primary Voluntary Academy, Lincoln",271,0,0,10,3.6900369003690037E-2,43,0.15867158671586715,29,0.1070110701107011,189,0.69741697416974169,0.95178817056396148,"As expected",null,"Primary",9253347,"Our Lady of Lincoln Catholic Primary School A Voluntary Academy",180,1,5.5555555555555558E-3,19,0.10555555555555556,40,0.22222222222222221,34,0.18888888888888888,86,0.4777777777777778,0.91832963784183297,"At risk of persistent absence",9253347,"Primary",9253347,"Our Lady of Lincoln Catholic Primary School A Voluntary Academy",184,3,1.6304347826086956E-2,10,5.434782608695652E-2,38,0.20652173913043478,46,0.25,87,0.47282608695652173,0.92405434463884273,"At risk of persistent absence"]
[null,null,"Primary",9253347,"Our Lady of Lincoln Catholic Primary School A Voluntary Academy",208,4,1.9230769230769232E-2,26,0.125,35,0.16826923076923078,26,0.125,116,0.55769230769230771,0.91196994095544825,"At risk of persistent absence",null,"Primary",9253350,"Blyton cum Laughton CE Primary School",113,1,8.8495575221238937E-3,6,5.3097345132743362E-2,20,0.17699115044247787,24,0.21238938053097345,62,0.54867256637168138,0.93139085211361516,"At risk of persistent absence",9253350,"Primary",9253350,"Blyton cum Laughton CE Primary School",114,2,1.7543859649122806E-2,5,4.3859649122807015E-2,21,0.18421052631578946,27,0.23684210526315788,59,0.51754385964912286,0.93057460752934007,"At risk of persistent absence"]
[null,null,"Primary",9253350,"Blyton cum Laughton CE Primary School",132,1,7.575757575757576E-3,3,2.2727272727272728E-2,23,0.17424242424242425,16,0.12121212121212122,89,0.6742424242424242,0.94597668467443841,"At risk of persistent absence",null,"Primary",9253353,"Friskney All Saints Church of England Primary School",73,0,0,3,4.1095890410958902E-2,12,0.16438356164383561,14,0.19178082191780821,44,0.60273972602739723,0.94428121720881431,"At risk of persistent absence",9253353,"Primary",9253353,"Friskney All Saints Church of England Primary School",73,0,0,1,1.3698630136986301E-2,13,0.17808219178082191,25,0.34246575342465752,34,0.46575342465753422,0.93983739837398372,"At risk of persistent absence"]
[null,null,"Primary",9253353,"Friskney All Saints Church of England Primary School",86,2,2.3255813953488372E-2,10,0.11627906976744186,8,9.3023255813953487E-2,13,0.15116279069767441,52,0.60465116279069764,0.92609082813891364,"At risk of persistent absence",null,"Primary",9253354,"The Gainsborough Parish Church CE Primary",269,7,2.6022304832713755E-2,15,5.5762081784386616E-2,57,0.21189591078066913,37,0.13754646840148699,153,0.56877323420074355,0.9274163015847261,"At risk of persistent absence",9253354,"Primary",9253354,"The Gainsborough Parish Church CE Primary",266,6,2.2556390977443608E-2,14,5.2631578947368418E-2,31,0.11654135338345864,61,0.22932330827067668,154,0.57894736842105265,0.93587140439932315,"At risk of persistent absence"]
[null,null,"Primary",9253354,"The Gainsborough Parish Church CE Primary",295,6,2.0338983050847456E-2,20,6.7796610169491525E-2,34,0.11525423728813559,35,0.11864406779661017,200,0.67796610169491522,0.94075814337418251,"At risk of persistent absence",null,"Primary",9253359,"Kirkby-on-Bain C of E Primary School",104,0,0,3,2.8846153846153848E-2,23,0.22115384615384615,21,0.20192307692307693,57,0.54807692307692313,0.94093466032020767,"At risk of persistent absence",9253359,"Primary",9253359,"Kirkby-on-Bain C of E Primary School",110,0,0,3,2.7272727272727271E-2,12,0.10909090909090909,20,0.18181818181818182,75,0.68181818181818177,0.95576000000000005,"As expected"]
[null,null,"Primary",9253359,"Kirkby-on-Bain C of E Primary School",110,2,1.8181818181818181E-2,5,4.5454545454545456E-2,13,0.11818181818181818,7,6.363636363636363E-2,83,0.75454545454545452,0.94158249158249163,"At risk of persistent absence",null,"Primary",9253361,"Lea Frances Olive Anderson School CE",149,0,0,0,0,25,0.16778523489932887,35,0.2348993288590604,89,0.59731543624161076,0.95248508946322064,"As expected",9253361,"Primary",9253361,"Lea Frances Olive Anderson School CE",149,0,0,3,2.0134228187919462E-2,21,0.14093959731543623,34,0.22818791946308725,91,0.61073825503355705,0.95429137067660419,"As expected"]
[null,null,"Primary",9253361,"Lea Frances Olive Anderson School CE",177,2,1.1299435028248588E-2,19,0.10734463276836158,30,0.16949152542372881,24,0.13559322033898305,102,0.57627118644067798,0.92310042778569978,"At risk of persistent absence",null,"Primary",9253364,"NETTLEHAM C E JUNIOR SCHOOL",225,0,0,4,1.7777777777777778E-2,25,0.1111111111111111,41,0.18222222222222223,155,0.68888888888888888,0.95779500430663222,"As expected",9253364,"Primary",9253364,"NETTLEHAM C E JUNIOR SCHOOL",228,5,2.1929824561403508E-2,4,1.7543859649122806E-2,31,0.13596491228070176,48,0.21052631578947367,140,0.61403508771929827,0.94960489618841026,"At risk of persistent absence"]
[null,null,"Primary",9253364,"NETTLEHAM C E JUNIOR SCHOOL",228,2,8.771929824561403E-3,8,3.5087719298245612E-2,28,0.12280701754385964,31,0.13596491228070176,159,0.69736842105263153,0.955078125,"As expected",null,"Primary",9253366,"Partney C of E Aided Primary School",63,1,1.5873015873015872E-2,5,7.9365079365079361E-2,17,0.26984126984126983,15,0.23809523809523808,25,0.3968253968253968,0.90273236805231205,"Persistent absence",9253366,"Primary",9253366,"Partney C of E Aided Primary School",63,1,1.5873015873015872E-2,5,7.9365079365079361E-2,10,0.15873015873015872,19,0.30158730158730157,28,0.44444444444444442,0.91390637831918975,"At risk of persistent absence"]
[null,null,"Primary",9253366,"Partney C of E Aided Primary School",68,1,1.4705882352941176E-2,4,5.8823529411764705E-2,6,8.8235294117647065E-2,8,0.11764705882352941,49,0.72058823529411764,0.94620077648363843,"At risk of persistent absence",null,"Primary",9253505,"Bishop King CE Community Primary School",389,13,3.3419023136246784E-2,16,4.1131105398457581E-2,62,0.15938303341902313,88,0.2262210796915167,210,0.53984575835475579,0.92936756418284283,"At risk of persistent absence",9253505,"Primary",9253505,"Bishop King CE Community Primary School",373,1,2.6809651474530832E-3,22,5.8981233243967826E-2,63,0.16890080428954424,80,0.21447721179624665,207,0.55495978552278824,0.93610006787549693,"At risk of persistent absence"]
[null,null,"Primary",9253505,"Bishop King CE Community Primary School",401,4,9.9750623441396506E-3,26,6.4837905236907731E-2,79,0.1970074812967581,53,0.13216957605985039,239,0.5960099750623441,0.93562790697674414,"At risk of persistent absence",null,"Primary",9253506,"Witham St Hughs Academy",364,0,0,8,2.197802197802198E-2,33,9.0659340659340656E-2,71,0.19505494505494506,252,0.69230769230769229,0.95953675158202179,"As expected",9253506,"Primary",9253506,"Witham St Hughs Academy",363,0,0,4,1.1019283746556474E-2,38,0.1046831955922865,64,0.17630853994490359,257,0.70798898071625349,0.96283366581172225,"As expected"]
[null,null,"Primary",9253506,"Witham St Hughs Academy",418,1,2.3923444976076554E-3,6,1.4354066985645933E-2,33,7.8947368421052627E-2,38,9.0909090909090912E-2,340,0.8133971291866029,0.9717827941699253,"As expected",null,"Primary",9253507,"Lincoln The Meadows Primary School",333,1,3.003003003003003E-3,19,5.7057057057057055E-2,60,0.18018018018018017,69,0.2072072072072072,184,0.55255255255255253,0.93321569766143264,"At risk of persistent absence",9253507,"Primary",9253507,"Lincoln The Meadows Primary School",332,2,6.024096385542169E-3,19,5.7228915662650599E-2,48,0.14457831325301204,57,0.1716867469879518,206,0.62048192771084343,0.94001673465118707,"At risk of persistent absence"]
[null,null,"Primary",9253507,"Lincoln The Meadows Primary School",384,2,5.208333333333333E-3,22,5.7291666666666664E-2,70,0.18229166666666666,41,0.10677083333333333,249,0.6484375,0.94462178371058236,"At risk of persistent absence",null,"Primary",9253510,"Bourne Abbey C of E Primary Academy",533,2,3.7523452157598499E-3,30,5.6285178236397747E-2,131,0.24577861163227016,135,0.25328330206378985,235,0.44090056285178236,0.92425446187895466,"At risk of persistent absence",9253510,"Primary",9253510,"Bourne Abbey C of E Primary Academy",539,0,0,13,2.4118738404452691E-2,80,0.14842300556586271,115,0.21335807050092764,331,0.614100185528757,0.95203184929844153,"As expected"]
[null,null,"Primary",9253510,"Bourne Abbey C of E Primary Academy",610,2,3.2786885245901639E-3,28,4.5901639344262293E-2,75,0.12295081967213115,46,7.5409836065573776E-2,459,0.75245901639344259,0.95543319542467753,"As expected",null,"Secondary",9254000,"Bourne Academy",1261,27,2.1411578112609041E-2,89,7.0578905630452021E-2,244,0.19349722442505948,289,0.22918318794607453,612,0.48532910388580491,0.91565328348022201,"At risk of persistent absence",{"$f":"AL273*1","v":9254000},"Secondary",9254000,"Bourne Academy",1250,28,2.24E-2,95,7.5999999999999998E-2,215,0.17199999999999999,270,0.216,642,0.51359999999999995,0.92229601916852322,"At risk of persistent absence"]
[null,null,"Primary",9255202,"Rauceby School CE",180,1,5.5555555555555558E-3,8,4.4444444444444446E-2,18,0.1,27,0.15,126,0.7,0.95584874298774158,"As expected",null,"Secondary",9254001,"University Academy Holbeach",1151,35,3.0408340573414423E-2,101,8.774978279756733E-2,306,0.26585577758470896,278,0.24152910512597742,431,0.37445699391833187,0.89495084868159969,"Persistent absence",9254001,"Secondary",9254001,"University Academy Holbeach",1142,46,4.0280210157618214E-2,96,8.4063047285464099E-2,227,0.19877408056042031,222,0.19439579684763572,551,0.48248686514886163,0.89873815256516587,"Persistent absence"]
[null,null,"Primary",9255203,"Sleaford The William Alvey C of E School",652,3,4.601226993865031E-3,34,5.2147239263803678E-2,84,0.12883435582822086,93,0.14263803680981596,438,0.67177914110429449,0.94799242528199357,"At risk of persistent absence",null,"Secondary",9254002,"King Edward VI Academy",461,15,3.2537960954446853E-2,45,9.7613882863340565E-2,116,0.25162689804772237,63,0.13665943600867678,222,0.48156182212581344,0.90404014007212674,"Persistent absence",9254002,"Secondary",9254002,"King Edward VI Academy",449,7,1.5590200445434299E-2,27,6.0133630289532294E-2,90,0.20044543429844097,82,0.18262806236080179,243,0.54120267260579069,0.92225475841874083,"At risk of persistent absence"]
[null,null,"Primary",9255205,"Malcolm Sargent Primary School",647,0,0,38,5.8732612055641419E-2,74,0.11437403400309119,67,0.1035548686244204,468,0.72333848531684697,0.9558155579830967,"As expected",null,"Secondary",9254004,"Kesteven & Grantham Girls' School",893,7,7.8387458006718928E-3,12,1.3437849944008958E-2,97,0.10862262038073908,220,0.24636058230683092,557,0.62374020156774912,0.94915918721430714,"At risk of persistent absence",9254004,"Secondary",9254004,"Kesteven & Grantham Girls' School",894,6,6.7114093959731542E-3,28,3.1319910514541388E-2,81,9.0604026845637578E-2,152,0.17002237136465326,627,0.70134228187919467,0.95379442747863796,"As expected"]
[null,null,"Primary",9255206,"Lacey Gardens Junior Academy",344,3,8.7209302325581394E-3,31,9.0116279069767435E-2,67,0.19476744186046513,50,0.14534883720930233,193,0.56104651162790697,0.92411484754981432,"At risk of persistent absence",null,"Secondary",9254005,"Kesteven & Sleaford High School",650,12,1.8461538461538463E-2,18,2.7692307692307693E-2,97,0.14923076923076922,148,0.22769230769230769,375,0.57692307692307687,0.93608736942070281,"At risk of persistent absence",9254005,"Secondary",9254005,"Kesteven & Sleaford High School",645,11,1.7054263565891473E-2,12,1.8604651162790697E-2,91,0.14108527131782947,154,0.23875968992248062,377,0.5844961240310077,0.94101153887630751,"At risk of persistent absence"]
[null,null,"Primary",9255207,"Cranwell Primary School",330,3,9.0909090909090905E-3,8,2.4242424242424242E-2,53,0.16060606060606061,24,7.2727272727272724E-2,242,0.73333333333333328,0.95585250338294991,"As expected",null,"Secondary",9254008,"Lincoln UTC",238,3,1.2605042016806723E-2,6,2.5210084033613446E-2,52,0.21848739495798319,54,0.22689075630252101,123,0.51680672268907568,0.93131043681227077,"At risk of persistent absence",9254008,"Secondary",9254008,"Lincoln UTC",233,3,1.2875536480686695E-2,6,2.575107296137339E-2,19,8.15450643776824E-2,32,0.13733905579399142,173,0.74248927038626611,0.96074957678831541,"As expected"]
[null,null,"Primary",9255208,"St Andrews C of E Primary School",270,2,7.4074074074074077E-3,10,3.7037037037037035E-2,36,0.13333333333333333,29,0.10740740740740741,193,0.71481481481481479,0.95442007998896705,"As expected",null,"Secondary",9254010,"The Deepings School",1185,43,3.6286919831223625E-2,129,0.10886075949367088,319,0.26919831223628693,262,0.22109704641350211,432,0.36455696202531646,0.88981759975215258,"Persistent absence",9254010,"Secondary",9254010,"The Deepings School",1176,34,2.8911564625850341E-2,90,7.6530612244897961E-2,248,0.21088435374149661,202,0.17176870748299319,602,0.51190476190476186,0.91038086942750807,"At risk of persistent absence"]
[null,null,"Primary",9255209,"Huttoft Primary School",154,0,0,6,3.896103896103896E-2,25,0.16233766233766234,16,0.1038961038961039,107,0.69480519480519476,0.95369939506747325,"As expected",null,"Secondary",9254011,"Barnes Wallis Academy",555,24,4.3243243243243246E-2,42,7.567567567567568E-2,122,0.21981981981981982,101,0.18198198198198198,266,0.47927927927927927,0.90444981027940674,"Persistent absence",9254011,"Secondary",9254011,"Barnes Wallis Academy",561,24,4.2780748663101602E-2,58,0.10338680926916222,108,0.19251336898395721,97,0.17290552584670232,274,0.48841354723707664,0.89492526479031242,"Persistent absence"]
[null,null,"Primary",9255211,"Spalding Primary Academy",420,3,7.1428571428571426E-3,34,8.0952380952380956E-2,70,0.16666666666666666,51,0.12142857142857143,262,0.62380952380952381,0.93326834455866714,"At risk of persistent absence",null,"Secondary",9254013,"Thomas Middlecott Academy",596,21,3.5234899328859058E-2,59,9.8993288590604023E-2,198,0.33221476510067116,107,0.17953020134228187,211,0.35402684563758391,0.88793652083248709,"Persistent absence",9254013,"Secondary",9254013,"Thomas Middlecott Academy",586,18,3.0716723549488054E-2,58,9.8976109215017066E-2,144,0.24573378839590443,125,0.21331058020477817,241,0.4112627986348123,0.89641147176095692,"Persistent absence"]
[null,null,"Primary",9255212,"Washingborough Academy",249,3,1.2048192771084338E-2,23,9.2369477911646583E-2,38,0.15261044176706828,24,9.6385542168674704E-2,161,0.64658634538152615,0.93097805875790252,"At risk of persistent absence",null,"Secondary",9254017,"Charles Read Academy",279,7,2.5089605734767026E-2,18,6.4516129032258063E-2,81,0.29032258064516131,70,0.25089605734767023,103,0.36917562724014336,0.90948413969881448,"Persistent absence",9254017,"Secondary",9254017,"Charles Read Academy",275,7,2.5454545454545455E-2,25,9.0909090909090912E-2,45,0.16363636363636364,65,0.23636363636363636,133,0.48363636363636364,0.91656904854874399,"At risk of persistent absence"]
[null,null,"Primary",9255214,"Wyberton Primary Academy",211,2,9.4786729857819912E-3,11,5.2132701421800945E-2,28,0.13270142180094788,18,8.5308056872037921E-2,152,0.72037914691943128,0.94905359985848226,"At risk of persistent absence",null,"Secondary",9254018,"Somercotes Academy",480,15,3.125E-2,66,0.13750000000000001,153,0.31874999999999998,86,0.17916666666666667,160,0.33333333333333331,0.88239742558326628,"Persistent absence",9254018,"Secondary",9254018,"Somercotes Academy",472,11,2.3305084745762712E-2,56,0.11864406779661017,91,0.19279661016949154,96,0.20338983050847459,218,0.46186440677966101,0.90705068262577149,"Persistent absence"]
[null,null,"Primary",9255215,"Old Leake Primary and Nursery School",175,6,3.4285714285714287E-2,9,5.1428571428571428E-2,27,0.15428571428571428,24,0.13714285714285715,109,0.62285714285714289,0.93298192771084343,"At risk of persistent absence",null,"Secondary",9254019,"Walton Academy",849,34,4.0047114252061249E-2,68,8.0094228504122497E-2,201,0.23674911660777384,153,0.18021201413427562,393,0.4628975265017668,0.9017411807381881,"Persistent absence",9254019,"Secondary",9254019,"Walton Academy",845,44,5.2071005917159761E-2,62,7.3372781065088752E-2,158,0.18698224852071005,165,0.19526627218934911,416,0.49230769230769234,0.8969275951654806,"Persistent absence"]
[null,null,"Primary",9255216,"Butterwick Pinchbeck's Endowed",278,2,7.1942446043165471E-3,21,7.5539568345323743E-2,39,0.14028776978417265,30,0.1079136690647482,186,0.6690647482014388,0.94559550862184205,"At risk of persistent absence",null,"Secondary",9254022,"Boston High School",576,2,3.472222222222222E-3,23,3.9930555555555552E-2,82,0.1423611111111111,105,0.18229166666666666,364,0.63194444444444442,0.94525989502611318,"At risk of persistent absence",9254022,"Secondary",9254022,"Boston High School",575,7,1.2173913043478261E-2,19,3.3043478260869563E-2,93,0.16173913043478261,110,0.19130434782608696,346,0.60173913043478255,0.93922935665598062,"At risk of persistent absence"]
[null,null,"Primary",9255217,"Grimoldby Primary",215,1,4.6511627906976744E-3,8,3.7209302325581395E-2,35,0.16279069767441862,33,0.15348837209302327,138,0.64186046511627903,0.95173845355474829,"As expected",null,"Secondary",9254027,"Spalding High School",748,7,9.3582887700534752E-3,23,3.074866310160428E-2,123,0.16443850267379678,184,0.24598930481283424,411,0.54946524064171121,0.9371059221792194,"At risk of persistent absence",9254027,"Secondary",9254027,"Spalding High School",748,8,1.06951871657754E-2,19,2.5401069518716578E-2,106,0.14171122994652408,162,0.21657754010695188,453,0.60561497326203206,0.94219104505255358,"At risk of persistent absence"]
[null,null,"Primary",9255218,"Wrangle Primary School",57,0,0,3,5.2631578947368418E-2,7,0.12280701754385964,4,7.0175438596491224E-2,43,0.75438596491228072,0.95811518324607325,"As expected",null,"Secondary",9254035,"Spalding Academy",1403,26,1.8531717747683536E-2,82,5.844618674269423E-2,307,0.21881682109764788,323,0.23022095509622237,665,0.47398431931575197,0.92262320444363266,"At risk of persistent absence",9254035,"Secondary",9254035,"Spalding Academy",1395,35,2.5089605734767026E-2,77,5.5197132616487454E-2,252,0.18064516129032257,320,0.22939068100358423,711,0.50967741935483868,0.92421846648348804,"At risk of persistent absence"]
[null,null,"Primary",9255219,"The Lancaster School",112,1,8.9285714285714281E-3,13,0.11607142857142858,21,0.1875,16,0.14285714285714285,61,0.5446428571428571,0.9201893811295232,"At risk of persistent absence",null,"Secondary",9254039,"Louth Academy",895,36,4.0223463687150837E-2,111,0.12402234636871508,230,0.25698324022346369,158,0.17653631284916202,360,0.4022346368715084,0.88444901984532065,"Persistent absence",9254039,"Secondary",9254039,"Louth Academy",875,46,5.2571428571428575E-2,88,0.10057142857142858,177,0.20228571428571429,169,0.19314285714285714,395,0.4514285714285714,0.88978956036869106,"Persistent absence"]
[null,null,"Primary",9255221,"Boston Tower Road Academy (Primary)",606,8,1.3201320132013201E-2,34,5.6105610561056105E-2,86,0.14191419141914191,72,0.11881188118811881,406,0.66996699669966997,0.94150572026079471,"At risk of persistent absence",null,"Secondary",9254041,"The Priory Pembroke Academy",523,12,2.2944550669216062E-2,40,7.6481835564053538E-2,109,0.2084130019120459,112,0.21414913957934992,250,0.47801147227533458,0.91305449223147939,"At risk of persistent absence",9254041,"Secondary",9254041,"The Priory Pembroke Academy",521,18,3.4548944337811902E-2,44,8.4452975047984644E-2,69,0.1324376199616123,103,0.19769673704414586,287,0.55086372360844527,0.91428762340677883,"At risk of persistent absence"]
[null,null,"Primary",9255222,"Barkston and Syston CE  School",107,0,0,6,5.6074766355140186E-2,13,0.12149532710280374,11,0.10280373831775701,77,0.71962616822429903,0.95359628770301619,"As expected",null,"Secondary",9254043,"The Gainsborough Academy",730,46,6.3013698630136991E-2,107,0.14657534246575343,188,0.25753424657534246,147,0.20136986301369864,242,0.33150684931506852,0.86293419997467602,"Persistent absence",9254043,"Secondary",9254043,"The Gainsborough Academy",706,53,7.5070821529745049E-2,98,0.13881019830028329,148,0.20963172804532579,100,0.14164305949008499,307,0.43484419263456092,0.8619131375997835,"Persistent absence"]
[null,null,"Primary",9255223,"The Nettleham Infant and Nursery School",164,0,0,20,0.12195121951219512,44,0.26829268292682928,24,0.14634146341463414,76,0.46341463414634149,0.91213011068443639,"At risk of persistent absence",null,"Secondary",9254044,"University Academy Long Sutton",720,34,4.7222222222222221E-2,111,0.15416666666666667,187,0.25972222222222224,142,0.19722222222222222,246,0.34166666666666667,0.87616121871416397,"Persistent absence",9254044,"Secondary",9254044,"University Academy Long Sutton",713,37,5.1893408134642355E-2,81,0.11360448807854137,159,0.22300140252454417,129,0.18092566619915848,307,0.43057503506311362,0.879836724115589,"Persistent absence"]
[null,null,"Primary",9255224,"Lincoln Westgate Academy",432,5,1.1574074074074073E-2,36,8.3333333333333329E-2,65,0.15046296296296297,61,0.14120370370370369,264,0.61111111111111116,0.92764782190233086,"At risk of persistent absence",null,"Secondary",9254048,"John Spendluffe Technology College",634,16,2.5236593059936908E-2,81,0.12776025236593061,163,0.25709779179810727,140,0.22082018927444794,234,0.36908517350157727,0.89233820858426538,"Persistent absence",9254048,"Secondary",9254048,"John Spendluffe Technology College",634,13,2.0504731861198739E-2,64,0.10094637223974763,175,0.27602523659305994,117,0.18454258675078863,265,0.41798107255520506,0.90020255419402107,"Persistent absence"]
[null,null,"Primary",9255225,"North Somercotes CofE Primary School",189,1,5.2910052910052907E-3,20,0.10582010582010581,39,0.20634920634920634,20,0.10582010582010581,109,0.57671957671957674,0.92514792899408282,"At risk of persistent absence",null,"Secondary",9254049,"Caistor Yarborough Academy",476,2,4.2016806722689074E-3,23,4.8319327731092439E-2,126,0.26470588235294118,95,0.19957983193277312,230,0.48319327731092437,0.92663301760020977,"At risk of persistent absence",9254049,"Secondary",9254049,"Caistor Yarborough Academy",482,4,8.2987551867219917E-3,15,3.1120331950207469E-2,75,0.15560165975103735,110,0.22821576763485477,278,0.57676348547717837,0.94226538198922694,"At risk of persistent absence"]
[null,null,"Primary",9255226,"Ruskington Chestnut Street CofE Primary School",177,0,0,9,5.0847457627118647E-2,28,0.15819209039548024,19,0.10734463276836158,121,0.68361581920903958,0.95386064030131823,"As expected",null,"Secondary",9254050,"Banovallum School",615,27,4.3902439024390241E-2,44,7.1544715447154475E-2,110,0.17886178861788618,129,0.2097560975609756,305,0.49593495934959347,0.90066411802185953,"Persistent absence",9254050,"Secondary",9254050,"Banovallum School",610,29,4.7540983606557376E-2,44,7.2131147540983612E-2,112,0.18360655737704917,115,0.18852459016393441,310,0.50819672131147542,0.89785622301340806,"Persistent absence"]
[null,null,"Primary",9255227,"Lincoln Mount Street Academy",256,5,1.953125E-2,23,8.984375E-2,36,0.140625,31,0.12109375,161,0.62890625,0.93206521739130432,"At risk of persistent absence",null,"Secondary",9254052,"The Giles Academy",807,51,6.3197026022304828E-2,98,0.12143742255266418,200,0.24783147459727387,159,0.19702602230483271,299,0.3705080545229244,0.8814301170453428,"Persistent absence",9254052,"Secondary",9254052,"The Giles Academy",800,49,6.1249999999999999E-2,83,0.10375,180,0.22500000000000001,181,0.22625000000000001,307,0.38374999999999998,0.88633681343622328,"Persistent absence"]
[null,null,"Primary",9255228,"William Hildyard Church of England Primary  & Nursery School",211,0,0,14,6.6350710900473939E-2,29,0.13744075829383887,15,7.1090047393364927E-2,153,0.72511848341232232,0.9497749139376821,"At risk of persistent absence",null,"Secondary",9254053,"West Grantham Church of England Secondary Academy",332,14,4.2168674698795178E-2,32,9.6385542168674704E-2,79,0.23795180722891565,64,0.19277108433734941,143,0.43072289156626509,0.89589759782371081,"Persistent absence",9254053,"Secondary",9254053,"West Grantham Church of England Secondary Academy",323,11,3.4055727554179564E-2,19,5.8823529411764705E-2,77,0.23839009287925697,64,0.19814241486068113,152,0.47058823529411764,0.91154520269124217,"At risk of persistent absence"]
[null,null,"Secondary",9254000,"Bourne Academy",993,19,1.9133937562940583E-2,71,7.1500503524672715E-2,141,0.1419939577039275,124,0.12487411883182276,638,0.64249748237663651,0.9326155291397189,"At risk of persistent absence",null,"Secondary",9254057,"Cowley Academy",638,30,4.7021943573667714E-2,48,7.5235109717868343E-2,130,0.20376175548589343,106,0.16614420062695925,324,0.50783699059561127,0.90827594539084211,"Persistent absence",9254057,"Secondary",9254057,"Cowley Academy",627,31,4.9441786283891544E-2,43,6.8580542264752797E-2,106,0.16905901116427433,140,0.22328548644338117,307,0.48963317384370014,0.9066758838633221,"Persistent absence"]
[null,null,"Secondary",9254001,"University Academy Holbeach",903,39,4.3189368770764118E-2,93,0.10299003322259136,167,0.1849390919158361,116,0.12846068660022147,488,0.54042081949058696,0.90258601118609783,"Persistent absence",null,"Secondary",9254065,"Queen Elizabeth's High School",932,10,1.0729613733905579E-2,16,1.7167381974248927E-2,142,0.15236051502145923,233,0.25,531,0.56974248927038629,0.93775018576667701,"At risk of persistent absence",9254065,"Secondary",9254065,"Queen Elizabeth's High School",932,11,1.1802575107296138E-2,18,1.9313304721030045E-2,112,0.12017167381974249,191,0.20493562231759657,600,0.64377682403433478,0.94661115705586041,"At risk of persistent absence"]
[null,null,"Secondary",9254002,"King Edward VI Academy",388,15,3.8659793814432991E-2,49,0.12628865979381443,76,0.19587628865979381,60,0.15463917525773196,188,0.4845360824742268,0.88609620634472375,"Persistent absence",null,"Secondary",9254067,"Stamford Welland Academy",572,25,4.3706293706293704E-2,34,5.944055944055944E-2,117,0.20454545454545456,127,0.22202797202797203,269,0.47027972027972026,0.90590986051761668,"Persistent absence",9254067,"Secondary",9254067,"Stamford Welland Academy",566,23,4.0636042402826852E-2,30,5.3003533568904596E-2,110,0.19434628975265017,116,0.20494699646643111,287,0.50706713780918733,0.91076250482191079,"At risk of persistent absence"]
[null,null,"Secondary",9254004,"Kesteven & Grantham Girls' School",710,5,7.0422535211267607E-3,13,1.8309859154929577E-2,65,9.154929577464789E-2,81,0.11408450704225352,546,0.76901408450704223,0.96379770692633893,"As expected",null,"Secondary",9254072,"Haven High Academy",1483,69,4.652730950775455E-2,184,0.12407282535401214,384,0.25893459204315578,329,0.22184760620364127,517,0.34861766689143625,0.87763651321600356,"Persistent absence",9254072,"Secondary",9254072,"Haven High Academy",1454,94,6.4649243466299869E-2,190,0.13067400275103164,340,0.23383768913342504,239,0.16437414030261349,591,0.40646492434663001,0.87077321255257201,"Persistent absence"]
[null,null,"Secondary",9254005,"Kesteven & Sleaford High School",506,8,1.5810276679841896E-2,18,3.5573122529644272E-2,61,0.12055335968379446,69,0.13636363636363635,350,0.69169960474308301,0.94552917683603288,"At risk of persistent absence",null,"Secondary",9254501,"Bourne Grammar School",1211,7,5.7803468208092483E-3,56,4.6242774566473986E-2,300,0.2477291494632535,257,0.21222130470685385,591,0.48802642444260941,0.92843316388371289,"At risk of persistent absence",9254501,"Secondary",9254501,"Bourne Grammar School",1214,12,9.8846787479406912E-3,34,2.800658978583196E-2,155,0.12767710049423395,209,0.17215815485996705,804,0.66227347611202636,0.94721516770295122,"At risk of persistent absence"]
[null,null,"Secondary",9254008,"Lincoln UTC",121,0,0,6,4.9586776859504134E-2,5,4.1322314049586778E-2,11,9.0909090909090912E-2,99,0.81818181818181823,0.96711859124201338,"As expected",null,"Secondary",9254514,"De Aston School",887,24,2.7057497181510709E-2,93,0.10484780157835401,200,0.22547914317925591,205,0.23111612175873733,365,0.41149943630214203,0.90027589279594211,"Persistent absence",9254514,"Secondary",9254514,"De Aston School",895,29,3.2402234636871509E-2,72,8.0446927374301674E-2,203,0.22681564245810057,181,0.20223463687150839,410,0.45810055865921789,0.90387300274057603,"Persistent absence"]
[null,null,"Secondary",9254010,"The Deepings School",910,21,2.3076923076923078E-2,48,5.2747252747252747E-2,177,0.19450549450549451,152,0.16703296703296702,512,0.56263736263736264,0.92382430478782207,"At risk of persistent absence",null,"Secondary",9254516,"William Lovell Church of England Academy",302,14,4.6357615894039736E-2,35,0.11589403973509933,77,0.25496688741721857,56,0.18543046357615894,120,0.39735099337748342,0.88520897852627267,"Persistent absence",9254516,"Secondary",9254516,"William Lovell Church of England Academy",307,20,6.5146579804560262E-2,46,0.14983713355048861,59,0.19218241042345277,52,0.16938110749185667,130,0.42345276872964172,0.86981932443047916,"Persistent absence"]
[null,null,"Secondary",9254011,"Barnes Wallis Academy",434,15,3.4562211981566823E-2,35,8.0645161290322578E-2,75,0.1728110599078341,49,0.11290322580645161,260,0.59907834101382484,0.91331845238095233,"At risk of persistent absence",null,"Secondary",9254603,"Spalding Grammar School",711,7,9.8452883263009851E-3,31,4.360056258790436E-2,153,0.21518987341772153,187,0.26300984528832633,333,0.46835443037974683,0.92597405341446926,"At risk of persistent absence",9254603,"Secondary",9254603,"Spalding Grammar School",707,3,4.2432814710042432E-3,16,2.2630834512022632E-2,87,0.12305516265912306,139,0.19660537482319659,462,0.65346534653465349,0.94953550720119706,"At risk of persistent absence"]
[null,null,"Secondary",9254013,"Thomas Middlecott Academy",473,17,3.5940803382663845E-2,58,0.1226215644820296,91,0.19238900634249473,96,0.20295983086680761,211,0.44608879492600423,0.8940645556065473,"Persistent absence",null,"Primary",9255202,"Rauceby School CE",155,1,6.4516129032258064E-3,6,3.870967741935484E-2,19,0.12258064516129032,37,0.23870967741935484,92,0.59354838709677415,0.94265044078190874,"At risk of persistent absence",9255202,"Primary",9255202,"Rauceby School CE",159,0,0,5,3.1446540880503145E-2,23,0.14465408805031446,33,0.20754716981132076,98,0.61635220125786161,0.94845076634689607,"At risk of persistent absence"]
[null,null,"Secondary",9254017,"Charles Read Academy",211,5,2.3696682464454975E-2,14,6.6350710900473939E-2,34,0.16113744075829384,41,0.19431279620853081,117,0.5545023696682464,0.92593850857822324,"At risk of persistent absence",null,"Primary",9255203,"Sleaford The William Alvey C of E School",545,2,3.669724770642202E-3,17,3.1192660550458717E-2,71,0.13027522935779817,109,0.2,346,0.63486238532110095,0.94917720658234739,"At risk of persistent absence",9255203,"Primary",9255203,"Sleaford The William Alvey C of E School",553,5,9.0415913200723331E-3,17,3.074141048824593E-2,66,0.11934900542495479,106,0.19168173598553345,359,0.64918625678119346,0.94952691174189541,"At risk of persistent absence"]
[null,null,"Secondary",9254018,"Somercotes Academy",379,15,3.9577836411609502E-2,42,0.11081794195250659,81,0.21372031662269128,62,0.16358839050131926,179,0.47229551451187335,0.89811464482955627,"Persistent absence",null,"Primary",9255205,"Malcolm Sargent Primary School",568,2,3.5211267605633804E-3,3,5.2816901408450703E-3,59,0.10387323943661972,117,0.20598591549295775,387,0.68133802816901412,0.95944021220713716,"As expected",9255205,"Primary",9255205,"Malcolm Sargent Primary School",568,0,0,3,5.2816901408450703E-3,27,4.7535211267605633E-2,94,0.16549295774647887,444,0.78169014084507038,0.97157307821212024,"As expected"]
[null,null,"Secondary",9254019,"Walton Academy",659,22,3.3383915022761758E-2,43,6.525037936267071E-2,109,0.165402124430956,105,0.15933232169954475,380,0.57663125948406679,0.91757493188010897,"At risk of persistent absence",null,"Primary",9255206,"Lacey Gardens Junior Academy",336,5,1.488095238095238E-2,24,7.1428571428571425E-2,71,0.21130952380952381,56,0.16666666666666666,180,0.5357142857142857,0.92675189393939394,"At risk of persistent absence",9255206,"Primary",9255206,"Lacey Gardens Junior Academy",334,10,2.9940119760479042E-2,17,5.089820359281437E-2,64,0.19161676646706588,69,0.20658682634730538,174,0.52095808383233533,0.92563841747416886,"At risk of persistent absence"]
[null,null,"Secondary",9254022,"Boston High School",463,5,1.079913606911447E-2,15,3.2397408207343416E-2,71,0.15334773218142547,69,0.14902807775377969,303,0.6544276457883369,0.94614728020485761,"At risk of persistent absence",null,"Primary",9255207,"Cranwell Primary School",267,0,0,3,1.1235955056179775E-2,23,8.6142322097378279E-2,59,0.22097378277153559,182,0.68164794007490637,0.95838558887242042,"As expected",9255207,"Primary",9255207,"Cranwell Primary School",268,1,3.7313432835820895E-3,4,1.4925373134328358E-2,25,9.3283582089552244E-2,40,0.14925373134328357,198,0.73880597014925375,0.9661418878861735,"As expected"]
[null,null,"Secondary",9254027,"Spalding High School",604,3,4.9668874172185433E-3,23,3.8079470198675497E-2,90,0.1490066225165563,82,0.13576158940397351,406,0.67218543046357615,0.94922906812457764,"At risk of persistent absence",null,"Primary",9255208,"St Andrews C of E Primary School",238,1,4.2016806722689074E-3,5,2.100840336134454E-2,43,0.18067226890756302,42,0.17647058823529413,147,0.61764705882352944,0.94656798451064894,"At risk of persistent absence",9255208,"Primary",9255208,"St Andrews C of E Primary School",237,0,0,8,3.3755274261603373E-2,34,0.14345991561181434,65,0.27426160337552741,130,0.54852320675105481,0.94472086046681791,"At risk of persistent absence"]
[null,null,"Secondary",9254035,"Spalding Academy",1076,19,1.7657992565055763E-2,73,6.7843866171003714E-2,181,0.16821561338289961,148,0.13754646840148699,654,0.60780669144981414,0.92904056018851211,"At risk of persistent absence",null,"Primary",9255209,"Huttoft Primary School",135,0,0,2,1.4814814814814815E-2,27,0.2,29,0.21481481481481482,77,0.57037037037037042,0.94101638433768398,"At risk of persistent absence",9255209,"Primary",9255209,"Huttoft Primary School",145,0,0,5,3.4482758620689655E-2,25,0.17241379310344829,32,0.22068965517241379,83,0.57241379310344831,0.94301924025653672,"At risk of persistent absence"]
[null,null,"Secondary",9254039,"Louth Academy",714,25,3.5014005602240897E-2,69,9.6638655462184878E-2,106,0.1484593837535014,88,0.12324929971988796,425,0.59523809523809523,0.91098656972634551,"At risk of persistent absence",null,"Primary",9255211,"Spalding Primary Academy",357,2,5.6022408963585435E-3,10,2.8011204481792718E-2,72,0.20168067226890757,96,0.26890756302521007,177,0.49579831932773111,0.9349046015712682,"At risk of persistent absence",9255211,"Primary",9255211,"Spalding Primary Academy",362,1,2.7624309392265192E-3,12,3.3149171270718231E-2,47,0.12983425414364641,63,0.17403314917127072,239,0.66022099447513816,0.9523002421307506,"As expected"]
[null,null,"Secondary",9254041,"The Priory Pembroke Academy",396,11,2.7777777777777776E-2,30,7.575757575757576E-2,65,0.16414141414141414,61,0.15404040404040403,229,0.57828282828282829,0.92203297203752621,"At risk of persistent absence",null,"Primary",9255212,"Washingborough Academy",226,5,2.2123893805309734E-2,10,4.4247787610619468E-2,40,0.17699115044247787,50,0.22123893805309736,121,0.53539823008849563,0.93473585159295602,"At risk of persistent absence",9255212,"Primary",9255212,"Washingborough Academy",228,3,1.3157894736842105E-2,6,2.6315789473684209E-2,34,0.14912280701754385,46,0.20175438596491227,139,0.60964912280701755,0.9422278597785978,"At risk of persistent absence"]
[null,null,"Secondary",9254043,"The Gainsborough Academy",559,65,0.11627906976744186,85,0.15205724508050089,82,0.14669051878354203,78,0.13953488372093023,248,0.44364937388193204,0.83594056813719075,"Persistent absence",null,"Primary",9255214,"Wyberton Primary Academy",181,1,5.5248618784530384E-3,6,3.3149171270718231E-2,39,0.21546961325966851,32,0.17679558011049723,103,0.56906077348066297,0.9388971071663379,"At risk of persistent absence",9255214,"Primary",9255214,"Wyberton Primary Academy",182,2,1.098901098901099E-2,5,2.7472527472527472E-2,19,0.1043956043956044,30,0.16483516483516483,126,0.69230769230769229,0.9561714778939292,"As expected"]
[null,null,"Secondary",9254044,"University Academy Long Sutton",569,23,4.0421792618629174E-2,75,0.13181019332161686,128,0.22495606326889278,77,0.13532513181019332,266,0.46748681898066785,0.8868414137432663,"Persistent absence",null,"Primary",9255215,"Old Leake Primary and Nursery School",150,3,0.02,8,5.3333333333333337E-2,36,0.24,20,0.13333333333333333,83,0.55333333333333334,0.93268112109994716,"At risk of persistent absence",9255215,"Primary",9255215,"Old Leake Primary and Nursery School",148,1,6.7567567567567571E-3,3,2.0270270270270271E-2,26,0.17567567567567569,26,0.17567567567567569,92,0.6216216216216216,0.94487847222222221,"At risk of persistent absence"]
[null,null,"Secondary",9254048,"John Spendluffe Technology College",506,17,3.3596837944664032E-2,64,0.12648221343873517,115,0.22727272727272727,69,0.13636363636363635,240,0.4743083003952569,0.89382032835270242,"Persistent absence",null,"Primary",9255216,"Butterwick Pinchbeck's Endowed",244,3,1.2295081967213115E-2,6,2.4590163934426229E-2,41,0.16803278688524589,53,0.21721311475409835,141,0.57786885245901642,0.94059496847646451,"At risk of persistent absence",9255216,"Primary",9255216,"Butterwick Pinchbeck's Endowed",242,1,4.1322314049586778E-3,8,3.3057851239669422E-2,28,0.11570247933884298,43,0.17768595041322313,162,0.66942148760330578,0.95173383317713212,"As expected"]
[null,null,"Secondary",9254049,"Caistor Yarborough Academy",342,2,5.8479532163742687E-3,15,4.3859649122807015E-2,58,0.16959064327485379,41,0.11988304093567251,226,0.66081871345029242,0.94321027986496786,"At risk of persistent absence",null,"Primary",9255217,"Grimoldby Primary",186,0,0,2,1.0752688172043012E-2,24,0.12903225806451613,53,0.28494623655913981,107,0.57526881720430112,0.95118807893677004,"As expected",9255217,"Primary",9255217,"Grimoldby Primary",188,0,0,1,5.3191489361702126E-3,21,0.11170212765957446,58,0.30851063829787234,108,0.57446808510638303,0.9541716714404509,"As expected"]
[null,null,"Secondary",9254050,"Banovallum School",481,12,2.4948024948024949E-2,46,9.5634095634095639E-2,82,0.17047817047817049,56,0.11642411642411643,285,0.59251559251559249,0.91749633402793862,"At risk of persistent absence",null,"Primary",9255218,"Wrangle Primary School",57,1,1.7543859649122806E-2,2,3.5087719298245612E-2,7,0.12280701754385964,16,0.2807017543859649,31,0.54385964912280704,0.93620963472736896,"At risk of persistent absence",9255218,"Primary",9255218,"Wrangle Primary School",55,2,3.6363636363636362E-2,3,5.4545454545454543E-2,15,0.27272727272727271,15,0.27272727272727271,20,0.36363636363636365,0.90705765407554673,"Persistent absence"]
[null,null,"Secondary",9254052,"The Giles Academy",604,43,7.1192052980132453E-2,69,0.11423841059602649,128,0.2119205298013245,74,0.12251655629139073,290,0.48013245033112584,0.87325567285523598,"Persistent absence",null,"Primary",9255219,"The Lancaster School",72,0,0,1,1.3888888888888888E-2,11,0.15277777777777779,14,0.19444444444444445,46,0.63888888888888884,0.95126582278481009,"As expected",9255219,"Primary",9255219,"The Lancaster School",73,0,0,5,6.8493150684931503E-2,10,0.13698630136986301,15,0.20547945205479451,43,0.58904109589041098,0.93861124459394518,"At risk of persistent absence"]
[null,null,"Secondary",9254053,"West Grantham Church of England Secondary Academy",227,13,5.7268722466960353E-2,23,0.1013215859030837,45,0.19823788546255505,26,0.11453744493392071,119,0.52422907488986781,0.89343298622774603,"Persistent absence",null,"Primary",9255221,"Boston Tower Road Academy (Primary)",540,8,1.4814814814814815E-2,23,4.2592592592592592E-2,103,0.19074074074074074,125,0.23148148148148148,281,0.52037037037037037,0.93122750899640139,"At risk of persistent absence",9255221,"Primary",9255221,"Boston Tower Road Academy (Primary)",538,9,1.6728624535315983E-2,5,9.2936802973977699E-3,40,7.434944237918216E-2,111,0.20631970260223048,373,0.69330855018587356,0.95918940808938991,"As expected"]
[null,null,"Secondary",9254057,"Cowley Academy",500,23,4.5999999999999999E-2,60,0.12,81,0.16200000000000001,73,0.14599999999999999,261,0.52200000000000002,0.88508557457212711,"Persistent absence",null,"Primary",9255222,"Barkston and Syston CE  School",89,0,0,4,4.49438202247191E-2,11,0.12359550561797752,10,0.11235955056179775,64,0.7191011235955056,0.95911257792445914,"As expected",9255222,"Primary",9255222,"Barkston and Syston CE  School",84,0,0,1,1.1904761904761904E-2,9,0.10714285714285714,22,0.26190476190476192,52,0.61904761904761907,0.959572192513369,"As expected"]
[null,null,"Secondary",9254065,"Queen Elizabeth's High School",747,8,1.0709504685408299E-2,27,3.614457831325301E-2,100,0.13386880856760375,86,0.11512717536813923,526,0.7041499330655957,0.94745855256626621,"At risk of persistent absence",null,"Primary",9255223,"The Nettleham Infant and Nursery School",112,1,8.9285714285714281E-3,1,8.9285714285714281E-3,12,0.10714285714285714,28,0.25,70,0.625,0.95487268364218103,"As expected",9255223,"Primary",9255223,"The Nettleham Infant and Nursery School",111,0,0,1,9.0090090090090089E-3,12,0.10810810810810811,17,0.15315315315315314,81,0.72972972972972971,0.96055118110236215,"As expected"]
[null,null,"Secondary",9254067,"Stamford Welland Academy",441,18,4.0816326530612242E-2,29,6.5759637188208611E-2,98,0.22222222222222221,71,0.16099773242630386,225,0.51020408163265307,0.90111283855658297,"Persistent absence",null,"Primary",9255224,"Lincoln Westgate Academy",442,4,9.0497737556561094E-3,25,5.6561085972850679E-2,62,0.14027149321266968,74,0.167420814479638,277,0.62669683257918551,0.93599746385107174,"At risk of persistent absence",9255224,"Primary",9255224,"Lincoln Westgate Academy",455,2,4.3956043956043956E-3,28,6.1538461538461542E-2,77,0.16923076923076924,112,0.24615384615384617,236,0.51868131868131873,0.93293107911663375,"At risk of persistent absence"]
[null,null,"Secondary",9254072,"Haven High Academy",1177,48,4.0781648258283773E-2,126,0.1070518266779949,246,0.20900594732370434,172,0.14613423959218352,585,0.49702633814783348,0.89627342484179628,"Persistent absence",null,"Primary",9255225,"North Somercotes CofE Primary School",171,1,5.8479532163742687E-3,9,5.2631578947368418E-2,39,0.22807017543859648,34,0.19883040935672514,88,0.51461988304093564,0.92947574505112029,"At risk of persistent absence",9255225,"Primary",9255225,"North Somercotes CofE Primary School",172,0,0,4,2.3255813953488372E-2,23,0.13372093023255813,38,0.22093023255813954,107,0.62209302325581395,0.95398365679264552,"As expected"]
[null,null,"Secondary",9254501,"Bourne Grammar School",969,4,4.1279669762641896E-3,32,3.3023735810113516E-2,106,0.10939112487100103,135,0.13931888544891641,692,0.71413828689370484,0.9562167749556999,"As expected",null,"Primary",9255226,"Ruskington Chestnut Street CofE Primary School",153,2,1.3071895424836602E-2,2,1.3071895424836602E-2,19,0.12418300653594772,28,0.18300653594771241,102,0.66666666666666663,0.95512756874813853,"As expected",9255226,"Primary",9255226,"Ruskington Chestnut Street CofE Primary School",151,1,6.6225165562913907E-3,3,1.9867549668874173E-2,21,0.13907284768211919,26,0.17218543046357615,100,0.66225165562913912,0.95733966195878673,"As expected"]
[null,null,"Secondary",9254514,"De Aston School",705,19,2.6950354609929079E-2,36,5.106382978723404E-2,67,9.50354609929078E-2,49,6.9503546099290783E-2,534,0.75744680851063828,0.94140417859794256,"At risk of persistent absence",null,"Primary",9255227,"Lincoln Mount Street Academy",177,6,3.3898305084745763E-2,12,6.7796610169491525E-2,42,0.23728813559322035,45,0.25423728813559321,72,0.40677966101694918,0.91799605664097506,"At risk of persistent absence",9255227,"Primary",9255227,"Lincoln Mount Street Academy",173,0,0,17,9.8265895953757232E-2,60,0.34682080924855491,36,0.20809248554913296,60,0.34682080924855491,0.9022130725681935,"Persistent absence"]
[null,null,"Secondary",9254516,"William Lovell Church of England Academy",242,12,4.9586776859504134E-2,41,0.16942148760330578,44,0.18181818181818182,36,0.1487603305785124,109,0.45041322314049587,0.87403807209396511,"Persistent absence",null,"Primary",9255228,"William Hildyard Church of England Primary  & Nursery School",180,1,5.5555555555555558E-3,7,3.888888888888889E-2,29,0.16111111111111112,47,0.26111111111111113,96,0.53333333333333333,0.9363800756205819,"At risk of persistent absence",9255228,"Primary",9255228,"William Hildyard Church of England Primary  & Nursery School",180,0,0,5,2.7777777777777776E-2,19,0.10555555555555556,45,0.25,111,0.6166666666666667,0.95223021582733813,"As expected"]
[null,null,"Secondary",9254603,"Spalding Grammar School",576,4,6.9444444444444441E-3,15,2.6041666666666668E-2,67,0.11631944444444445,79,0.13715277777777779,411,0.71354166666666663,0.95470058951287617,"As expected",null,"Secondary",9255400,"Skegness Grammar School",548,13,2.3722627737226276E-2,46,8.3941605839416053E-2,159,0.29014598540145986,104,0.18978102189781021,226,0.41240875912408759,0.90621544219808892,"Persistent absence",9255400,"Secondary",9255400,"Skegness Grammar School",536,17,3.1716417910447763E-2,35,6.5298507462686561E-2,126,0.23507462686567165,105,0.19589552238805971,253,0.47201492537313433,0.9067083474146671,"Persistent absence"]
[null,null,"Secondary",9255400,"Skegness Grammar School",414,6,1.4492753623188406E-2,25,6.0386473429951688E-2,66,0.15942028985507245,70,0.16908212560386474,247,0.59661835748792269,0.93065962146476677,"At risk of persistent absence",null,"Secondary",9255401,"Queen Elizabeth's Grammar, Alford - A Selective Academy",429,5,1.1655011655011656E-2,13,3.0303030303030304E-2,62,0.14452214452214451,91,0.21212121212121213,258,0.60139860139860135,0.94069076982537503,"At risk of persistent absence",9255401,"Secondary",9255401,"Queen Elizabeth's Grammar, Alford - A Selective Academy",426,4,9.3896713615023476E-3,19,4.4600938967136149E-2,48,0.11267605633802817,97,0.22769953051643194,258,0.60563380281690138,0.94324049603577964,"At risk of persistent absence"]
[null,null,"Secondary",9255401,"Queen Elizabeth's Grammar, Alford - A Selective Academy",346,6,1.7341040462427744E-2,20,5.7803468208092484E-2,38,0.10982658959537572,46,0.13294797687861271,236,0.68208092485549132,0.93962205378465369,"At risk of persistent absence",null,"Secondary",9255402,"The King's School, Grantham.",890,1,1.1235955056179776E-3,13,1.4606741573033709E-2,149,0.16741573033707866,211,0.23707865168539327,516,0.57977528089887642,0.94726326087316981,"At risk of persistent absence",9255402,"Secondary",9255402,"The King's School, Grantham.",890,3,3.3707865168539327E-3,14,1.5730337078651686E-2,93,0.10449438202247191,178,0.2,602,0.67640449438202244,0.95726773374283858,"As expected"]
[null,null,"Secondary",9255402,"The King's School, Grantham.",708,1,1.4124293785310734E-3,18,2.5423728813559324E-2,87,0.1228813559322034,78,0.11016949152542373,524,0.74011299435028244,0.96165515798284162,"As expected",null,"Secondary",9255403,"Carre's Grammar School",578,5,8.6505190311418692E-3,19,3.2871972318339097E-2,134,0.23183391003460208,126,0.2179930795847751,294,0.50865051903114189,0.93048675001965875,"At risk of persistent absence",9255403,"Secondary",9255403,"Carre's Grammar School",578,4,6.920415224913495E-3,16,2.768166089965398E-2,79,0.13667820069204153,125,0.21626297577854672,354,0.61245674740484424,0.94567398400766678,"At risk of persistent absence"]
[null,null,"Secondary",9255403,"Carre's Grammar School",430,4,9.3023255813953487E-3,16,3.7209302325581395E-2,66,0.15348837209302327,50,0.11627906976744186,294,0.68372093023255809,0.94689465070204148,"At risk of persistent absence",null,"Secondary",9255405,"KING EDWARD VI GRAMMAR SCHOOL",768,9,1.171875E-2,35,4.5572916666666664E-2,115,0.14973958333333334,189,0.24609375,420,0.546875,0.93333841739511736,"At risk of persistent absence",9255405,"Secondary",9255405,"KING EDWARD VI GRAMMAR SCHOOL",767,10,1.303780964797914E-2,21,2.7379400260756193E-2,123,0.16036505867014342,162,0.21121251629726207,451,0.58800521512385917,0.94020474113579355,"At risk of persistent absence"]
[null,null,"Secondary",9255405,"KING EDWARD VI GRAMMAR SCHOOL",618,11,1.7799352750809062E-2,20,3.2362459546925564E-2,69,0.11165048543689321,104,0.16828478964401294,414,0.66990291262135926,0.94281907189618219,"At risk of persistent absence",null,"Secondary",9255406,"CAISTOR GRAMMAR SCHOOL",509,3,5.893909626719057E-3,10,1.9646365422396856E-2,65,0.12770137524557956,83,0.16306483300589392,348,0.68369351669941059,0.95230760027517725,"As expected",9255406,"Secondary",9255406,"CAISTOR GRAMMAR SCHOOL",504,3,5.9523809523809521E-3,5,9.9206349206349201E-3,35,6.9444444444444448E-2,77,0.15277777777777779,384,0.76190476190476186,0.96295134532273807,"As expected"]
[null,null,"Secondary",9255406,"CAISTOR GRAMMAR SCHOOL",407,3,7.3710073710073713E-3,6,1.4742014742014743E-2,20,4.9140049140049137E-2,23,5.6511056511056514E-2,355,0.87223587223587229,0.9728706912274302,"As expected",null,"Secondary",9255407,"Lincoln Castle Academy",758,63,8.3113456464379953E-2,118,0.15567282321899736,161,0.21240105540897097,152,0.20052770448548812,264,0.34828496042216361,0.84321177570657257,"Persistent absence",9255407,"Secondary",9255407,"Lincoln Castle Academy",722,65,9.0027700831024932E-2,92,0.12742382271468145,152,0.21052631578947367,119,0.16481994459833796,294,0.40720221606648199,0.85245064887006006,"Persistent absence"]
[null,null,"Secondary",9255407,"Lincoln Castle Academy",633,62,9.7946287519747238E-2,108,0.17061611374407584,123,0.19431279620853081,74,0.11690363349131122,266,0.42022116903633494,0.83124367738573313,"Persistent absence",null,"Secondary",9255408,"LINCOLN CHRIST'S HOSPITAL SCH",1096,54,4.9270072992700732E-2,127,0.11587591240875912,236,0.21532846715328466,218,0.1989051094890511,461,0.42062043795620441,0.88713999120589204,"Persistent absence",9255408,"Secondary",9255408,"LINCOLN CHRIST'S HOSPITAL SCH",1076,68,6.3197026022304828E-2,83,7.7137546468401486E-2,197,0.18308550185873607,174,0.16171003717472118,554,0.51486988847583648,0.88668445817824282,"Persistent absence"]
[null,null,"Secondary",9255408,"LINCOLN CHRIST'S HOSPITAL SCH",864,42,4.8611111111111112E-2,90,0.10416666666666667,162,0.1875,110,0.12731481481481483,460,0.53240740740740744,0.89198235204624976,"Persistent absence",null,"Secondary",9255411,"QUEEN ELIZABETH'S G.S.",618,3,4.8543689320388345E-3,12,1.9417475728155338E-2,96,0.1553398058252427,149,0.24110032362459546,358,0.57928802588996764,0.94385194479297363,"At risk of persistent absence",9255411,"Secondary",9255411,"QUEEN ELIZABETH'S G.S.",617,5,8.1037277147487843E-3,12,1.9448946515397084E-2,78,0.12641815235008103,123,0.19935170178282011,399,0.64667747163695299,0.94853258213803215,"At risk of persistent absence"]
[null,null,"Secondary",9255411,"QUEEN ELIZABETH'S G.S.",499,7,1.4028056112224449E-2,6,1.2024048096192385E-2,54,0.10821643286573146,74,0.14829659318637275,358,0.71743486973947901,0.95462990487514865,"As expected",null,"Secondary",9255412,"North Kesteven Academy",601,41,6.8219633943427616E-2,79,0.13144758735440931,145,0.24126455906821964,128,0.21297836938435941,208,0.34608985024958405,0.8673447167176912,"Persistent absence",{"$f":"AL337*1","v":9255412},"Secondary",9255412,"North Kesteven Academy",603,46,7.6285240464344942E-2,73,0.12106135986733002,135,0.22388059701492538,111,0.18407960199004975,238,0.3946932006633499,0.86000243368216112,"Persistent absence"]
[null,null,"Secondary",9255412,"North Kesteven Academy",489,34,6.9529652351738247E-2,62,0.12678936605316973,94,0.19222903885480572,64,0.130879345603272,234,0.4785276073619632,0.86779216774591428,"Persistent absence",null,"Secondary",9255413,"Sir Robert Pattinson Academy",1186,23,1.93929173693086E-2,86,7.2512647554806076E-2,265,0.22344013490725126,289,0.24367622259696459,523,0.44097807757166946,0.9139991102924131,"At risk of persistent absence",9255413,"Secondary",9255413,"Sir Robert Pattinson Academy",1172,26,2.2184300341296929E-2,71,6.0580204778156996E-2,231,0.19709897610921501,248,0.21160409556313994,596,0.50853242320819114,0.92230565272609788,"At risk of persistent absence"]
[null,null,"Secondary",9255413,"Sir Robert Pattinson Academy",946,27,2.8541226215644821E-2,86,9.0909090909090912E-2,174,0.1839323467230444,129,0.13636363636363635,529,0.55919661733615222,0.91312497533641135,"At risk of persistent absence",null,"Secondary",9255415,"William Farr CofE Comprehensive School",1214,19,1.5650741350906095E-2,48,3.9538714991762765E-2,237,0.19522240527182866,284,0.23393739703459637,626,0.51565074135090605,0.92885539071219858,"At risk of persistent absence",9255415,"Secondary",9255415,"William Farr CofE Comprehensive School",1206,19,1.5754560530679935E-2,37,3.0679933665008291E-2,214,0.17744610281923714,239,0.19817578772802655,697,0.57794361525704807,0.93595135811910068,"At risk of persistent absence"]
[null,null,"Secondary",9255415,"William Farr CofE Comprehensive School",967,16,1.6546018614270942E-2,59,6.1013443640124093E-2,123,0.12719751809720786,116,0.11995863495346432,653,0.67528438469493279,0.93781266835988608,"At risk of persistent absence",null,"Secondary",9255418,"Branston Community Academy",1081,23,2.1276595744680851E-2,68,6.290471785383904E-2,233,0.21554116558741906,186,0.17206290471785385,571,0.52821461609620723,0.91998475263150858,"At risk of persistent absence",9255418,"Secondary",9255418,"Branston Community Academy",1074,25,2.3277467411545624E-2,52,4.8417132216014895E-2,192,0.1787709497206704,212,0.1973929236499069,593,0.55214152700186214,0.92399246582015393,"At risk of persistent absence"]
[null,null,"Secondary",9255418,"Branston Community Academy",852,19,2.2300469483568074E-2,63,7.3943661971830985E-2,149,0.17488262910798122,112,0.13145539906103287,509,0.59741784037558687,0.92647574005955513,"At risk of persistent absence",null,"Secondary",9255420,"Sir William Robertson Academy",927,19,2.0496224379719527E-2,82,8.8457389428263214E-2,228,0.2459546925566343,226,0.24379719525350593,372,0.40129449838187703,0.90116718243621918,"Persistent absence",9255420,"Secondary",9255420,"Sir William Robertson Academy",919,27,2.9379760609357999E-2,70,7.6169749727965183E-2,188,0.20457018498367791,189,0.20565832426550598,445,0.4842219804134929,0.90760794524330823,"Persistent absence"]
[null,null,"Secondary",9255420,"Sir William Robertson Academy",675,18,2.6666666666666668E-2,57,8.4444444444444447E-2,113,0.16740740740740739,110,0.16296296296296298,377,0.55851851851851853,0.91263555837633492,"At risk of persistent absence",null,"Secondary",9255421,"St Peter and St Paul, Catholic Voluntary Academy",550,37,6.7272727272727276E-2,79,0.14363636363636365,120,0.21818181818181817,102,0.18545454545454546,212,0.38545454545454544,0.85619682359614291,"Persistent absence",9255421,"Secondary",9255421,"St Peter and St Paul, Catholic Voluntary Academy",558,55,9.8566308243727599E-2,51,9.1397849462365593E-2,103,0.18458781362007168,101,0.18100358422939067,248,0.44444444444444442,0.85278764175489696,"Persistent absence"]
[null,null,"Secondary",9255421,"St Peter and St Paul, Catholic Voluntary Academy",418,39,9.3301435406698566E-2,36,8.6124401913875603E-2,64,0.15311004784688995,69,0.16507177033492823,210,0.50239234449760761,0.86638323716975407,"Persistent absence",null,"Secondary",9255424,"Boston Grammar School",643,1,1.5552099533437014E-3,24,3.7325038880248837E-2,146,0.22706065318818042,131,0.20373250388802489,341,0.53032659409020222,0.93563091129668674,"At risk of persistent absence",9255424,"Secondary",9255424,"Boston Grammar School",650,3,4.6153846153846158E-3,26,0.04,106,0.16307692307692306,160,0.24615384615384617,355,0.5461538461538461,0.93913420397662128,"At risk of persistent absence"]
[null,null,"Secondary",9255424,"Boston Grammar School",509,3,5.893909626719057E-3,25,4.9115913555992138E-2,70,0.13752455795677801,76,0.14931237721021612,335,0.65815324165029465,0.94553023354265153,"At risk of persistent absence",null,"All-Through",9256905,"The Priory Witham Academy",927,37,3.9913700107874865E-2,78,8.4142394822006472E-2,185,0.19956850053937433,241,0.25997842502696872,386,0.41639697950377563,0.89647810466107436,"Persistent absence",9256905,"All-Through",9256905,"The Priory Witham Academy",923,41,4.4420368364030335E-2,67,7.2589382448537382E-2,150,0.16251354279523295,189,0.20476706392199351,476,0.5157096424702059,0.90296122810843615,"Persistent absence"]
[null,null,"Secondary",9256906,"The Priory City of Lincoln Academy",682,35,5.1319648093841645E-2,60,8.797653958944282E-2,135,0.19794721407624633,105,0.15395894428152493,347,0.50879765395894427,0.89303279766444854,"Persistent absence",null,"Secondary",9256906,"The Priory City of Lincoln Academy",870,39,4.4827586206896551E-2,55,6.3218390804597707E-2,183,0.2103448275862069,178,0.2045977011494253,415,0.47701149425287354,0.90114338951469464,"Persistent absence",9256906,"Secondary",9256906,"The Priory City of Lincoln Academy",865,57,6.5895953757225428E-2,66,7.6300578034682084E-2,142,0.16416184971098266,186,0.21502890173410405,414,0.47861271676300576,0.88706942893768348,"Persistent absence"]
[null,null,"Secondary",9256907,"The Priory Academy LSST",1079,22,2.0389249304911955E-2,48,4.4485634847080631E-2,145,0.13438368860055608,161,0.14921223354958293,703,0.65152919369786844,0.93496137552952907,"At risk of persistent absence",null,"Secondary",9256907,"The Priory Academy LSST",1337,29,2.169035153328347E-2,52,3.889304412864622E-2,232,0.17352281226626776,304,0.22737471952131638,720,0.53851907255048614,0.92783674004192873,"At risk of persistent absence",9256907,"Secondary",9256907,"The Priory Academy LSST",1331,34,2.5544703230653644E-2,45,3.3809166040571E-2,199,0.14951164537941397,295,0.22163786626596543,758,0.56949661908339599,0.93175801549171489,"At risk of persistent absence"]
[null,null,"Secondary",9256909,"St George's Academy",1573,81,5.1493960584869679E-2,165,0.1048951048951049,256,0.16274634456452639,193,0.12269548633184997,878,0.55816910362364913,0.89501337183158591,"Persistent absence",null,"Secondary",9256909,"St George's Academy",2046,96,4.6920821114369501E-2,181,8.8465298142717502E-2,422,0.20625610948191594,407,0.19892473118279569,940,0.45943304007820135,0.893941145109034,"Persistent absence",9256909,"Secondary",9256909,"St George's Academy",2010,103,5.124378109452736E-2,166,8.2587064676616917E-2,382,0.1900497512437811,370,0.18407960199004975,989,0.49203980099502487,0.8931253506089285,"Persistent absence"]
[null,null,"Secondary",9256910,"The Priory Ruskin Academy",950,30,3.1578947368421054E-2,84,8.8421052631578942E-2,162,0.17052631578947369,153,0.16105263157894736,519,0.5463157894736842,0.90977628297180868,"Persistent absence",null,"Secondary",9256910,"The Priory Ruskin Academy",1189,21,1.7661900756938603E-2,114,9.5878889823380997E-2,233,0.19596299411269974,240,0.20185029436501262,581,0.48864592094196801,0.91163832904472875,"At risk of persistent absence",9256910,"Secondary",9256910,"The Priory Ruskin Academy",1203,37,3.0756442227763924E-2,102,8.4788029925187039E-2,228,0.18952618453865336,259,0.21529509559434745,577,0.47963424771404822,0.90827440961692951,"Persistent absence"]
[null,null,"Secondary",9256911,"Skegness Academy",738,37,5.0135501355013552E-2,125,0.16937669376693767,140,0.18970189701897019,116,0.15718157181571815,318,0.43089430894308944,0.86888300480533487,"Persistent absence",null,"Secondary",9256911,"Skegness Academy",968,79,8.161157024793389E-2,187,0.19318181818181818,259,0.2675619834710744,141,0.14566115702479338,302,0.31198347107438018,0.83995664433963058,"Persistent absence",9256911,"Secondary",9256911,"Skegness Academy",943,79,8.3775185577942737E-2,148,0.15694591728525981,199,0.21102863202545069,118,0.12513255567338283,399,0.42311770943796395,0.85687405790321747,"Persistent absence"]
[null,null,"Special",9257002,"Community Inclusive Trust (Ambergate)",155,2,1.2903225806451613E-2,17,0.10967741935483871,28,0.18064516129032257,10,6.4516129032258063E-2,98,0.63225806451612898,0.921844894026975,"At risk of persistent absence",null,"Special",9257002,"Community Inclusive Trust (Ambergate)",174,2,1.1494252873563218E-2,24,0.13793103448275862,37,0.21264367816091953,33,0.18965517241379309,78,0.44827586206896552,0.90343790287924364,"Persistent absence",9257002,"Special",9257002,"Community Inclusive Trust (Ambergate)",173,2,1.1560693641618497E-2,21,0.12138728323699421,40,0.23121387283236994,33,0.19075144508670519,77,0.44508670520231214,0.90699847538484235,"Persistent absence"]
[null,null,"Special",9257005,"Sandon School",42,0,0,4,9.5238095238095233E-2,5,0.11904761904761904,2,4.7619047619047616E-2,31,0.73809523809523814,0.9421753097751262,"At risk of persistent absence",null,"Special",9257005,"Sandon School",50,0,0,5,0.1,13,0.26,10,0.2,22,0.44,0.90732661350985411,"Persistent absence",9257005,"Special",9257005,"Sandon School",50,1,0.02,4,0.08,9,0.18,10,0.2,26,0.52,0.91765311374163661,"At risk of persistent absence"]
[null,null,"Special",9257008,"Gosberton House Academy",101,3,2.9702970297029702E-2,8,7.9207920792079209E-2,21,0.20792079207920791,21,0.20792079207920791,48,0.47524752475247523,0.90386029411764701,"Persistent absence",null,"Special",9257008,"Gosberton House Academy",93,1,1.0752688172043012E-2,13,0.13978494623655913,27,0.29032258064516131,19,0.20430107526881722,33,0.35483870967741937,0.89505878614553547,"Persistent absence",9257008,"Special",9257008,"Gosberton House Academy",93,3,3.2258064516129031E-2,10,0.10752688172043011,25,0.26881720430107525,23,0.24731182795698925,32,0.34408602150537637,0.88717901177343095,"Persistent absence"]
[null,null,"Special",9257009,"Tulip Academy",110,4,3.6363636363636362E-2,7,6.363636363636363E-2,16,0.14545454545454545,17,0.15454545454545454,66,0.6,0.91567076249789603,"At risk of persistent absence",null,"Special",9257009,"Tulip Academy",187,9,4.8128342245989303E-2,22,0.11764705882352941,45,0.24064171122994651,32,0.17112299465240641,79,0.42245989304812837,0.87945629171414619,"Persistent absence",9257009,"Special",9257009,"Tulip Academy",188,10,5.3191489361702128E-2,17,9.0425531914893623E-2,40,0.21276595744680851,43,0.22872340425531915,78,0.41489361702127658,0.8916325009317928,"Persistent absence"]
[null,null,"Special",9257010,"Boston Endeavour Academy",78,5,6.4102564102564097E-2,17,0.21794871794871795,8,0.10256410256410256,5,6.4102564102564097E-2,43,0.55128205128205132,0.87659063625450184,"Persistent absence",null,"Special",9257010,"Boston Endeavour Academy",106,6,5.6603773584905662E-2,12,0.11320754716981132,29,0.27358490566037735,23,0.21698113207547171,36,0.33962264150943394,0.87257737923054668,"Persistent absence",9257010,"Special",9257010,"Boston Endeavour Academy",105,5,4.7619047619047616E-2,10,9.5238095238095233E-2,28,0.26666666666666666,15,0.14285714285714285,47,0.44761904761904764,0.87510442773600672,"Persistent absence"]
[null,null,"Special",9257012,"The Pilgrim School",79,13,0.16455696202531644,5,6.3291139240506333E-2,3,3.7974683544303799E-2,2,2.5316455696202531E-2,49,0.620253164556962,0.77555555555555555,"At risk of severe absence",null,"Special",9257012,"The Pilgrim School",106,81,0.76415094339622647,17,0.16037735849056603,5,4.716981132075472E-2,2,1.8867924528301886E-2,1,9.433962264150943E-3,0.3530528313824739,"Severe absence",9257012,"Special",9257012,"The Pilgrim School",121,90,0.74380165289256195,21,0.17355371900826447,7,5.7851239669421489E-2,2,1.6528925619834711E-2,1,8.2644628099173556E-3,0.35571315996847913,"Severe absence"]
[null,null,"Special",9257015,"Lincoln St Christopher's",188,3,1.5957446808510637E-2,6,3.1914893617021274E-2,24,0.1276595744680851,27,0.14361702127659576,128,0.68085106382978722,0.94709359605911325,"At risk of persistent absence",null,"Special",9257015,"Lincoln St Christopher's",201,1,4.9751243781094526E-3,14,6.965174129353234E-2,36,0.17910447761194029,44,0.21890547263681592,106,0.52736318407960203,0.92795462861324551,"At risk of persistent absence",9257015,"Special",9257015,"Lincoln St Christopher's",201,3,1.4925373134328358E-2,4,1.9900497512437811E-2,34,0.1691542288557214,47,0.23383084577114427,113,0.56218905472636815,0.93382162860835849,"At risk of persistent absence"]
[null,null,"Special",9257016,"Lincoln, St Francis School",98,6,6.1224489795918366E-2,14,0.14285714285714285,21,0.21428571428571427,12,0.12244897959183673,45,0.45918367346938777,0.85631963119477528,"Persistent absence",null,"Special",9257016,"Lincoln, St Francis School",106,2,1.8867924528301886E-2,22,0.20754716981132076,30,0.28301886792452829,17,0.16037735849056603,35,0.330188679245283,0.8617892016082711,"Persistent absence",9257016,"Special",9257016,"Lincoln, St Francis School",105,0,0,0,0,0,0,0,0,105,1,1,"As expected"]
[null,null,"Special",9257021,"St Lawrence School",155,13,8.387096774193549E-2,19,0.12258064516129032,23,0.14838709677419354,12,7.7419354838709681E-2,88,0.56774193548387097,0.84790919952210275,"Persistent absence",null,"Special",9257021,"St Lawrence School",180,15,8.3333333333333329E-2,19,0.10555555555555556,52,0.28888888888888886,30,0.16666666666666666,64,0.35555555555555557,0.85278914940247286,"Persistent absence",9257021,"Special",9257021,"St Lawrence School",180,12,6.6666666666666666E-2,23,0.12777777777777777,44,0.24444444444444444,34,0.18888888888888888,67,0.37222222222222223,0.85426073590162355,"Persistent absence"]
[null,null,"Special",9257024,"The Eresby School",64,4,6.25E-2,10,0.15625,10,0.15625,5,7.8125E-2,35,0.546875,0.86455916473317862,"Persistent absence",null,"Special",9257024,"The Eresby School",66,4,6.0606060606060608E-2,9,0.13636363636363635,19,0.2878787878787879,9,0.13636363636363635,25,0.37878787878787878,0.85327540106951871,"Persistent absence",9257024,"Special",9257024,"The Eresby School",68,3,4.4117647058823532E-2,11,0.16176470588235295,10,0.14705882352941177,16,0.23529411764705882,28,0.41176470588235292,0.88560546361964798,"Persistent absence"]
[null,null,"Special",9257025,"St Bernards School, Louth",52,2,3.8461538461538464E-2,8,0.15384615384615385,10,0.19230769230769232,2,3.8461538461538464E-2,30,0.57692307692307687,0.89343965204784337,"Persistent absence",null,"Special",9257025,"St Bernards School, Louth",68,3,4.4117647058823532E-2,11,0.16176470588235295,16,0.23529411764705882,13,0.19117647058823528,25,0.36764705882352944,0.855157437567861,"Persistent absence",9257025,"Special",9257025,"St Bernards School, Louth",68,5,7.3529411764705885E-2,10,0.14705882352941177,13,0.19117647058823528,14,0.20588235294117646,26,0.38235294117647056,0.85710646968925119,"Persistent absence"]
[null,null,"Special",9257028,"Willoughby Academy",114,2,1.7543859649122806E-2,3,2.6315789473684209E-2,18,0.15789473684210525,21,0.18421052631578946,70,0.61403508771929827,0.9350980704831765,"At risk of persistent absence",null,"Special",9257028,"Willoughby Academy",115,2,1.7391304347826087E-2,11,9.5652173913043481E-2,27,0.23478260869565218,15,0.13043478260869565,60,0.52173913043478259,0.92301750772399593,"At risk of persistent absence",9257028,"Special",9257028,"Willoughby Academy",113,2,1.7699115044247787E-2,12,0.10619469026548672,22,0.19469026548672566,26,0.23008849557522124,51,0.45132743362831856,0.91449699584039434,"At risk of persistent absence"]
[null,null,"Special",9257029,"Greenfields Academy",69,7,0.10144927536231885,11,0.15942028985507245,10,0.14492753623188406,7,0.10144927536231885,34,0.49275362318840582,0.8415240198785201,"Persistent absence",null,"Special",9257029,"Greenfields Academy",76,10,0.13157894736842105,16,0.21052631578947367,18,0.23684210526315788,7,9.2105263157894732E-2,25,0.32894736842105265,0.7793224178766347,"At risk of severe absence",9257029,"Special",9257029,"Greenfields Academy",77,13,0.16883116883116883,18,0.23376623376623376,10,0.12987012987012986,9,0.11688311688311688,27,0.35064935064935066,0.79489403891436361,"At risk of severe absence"]
[null,null,"Special",9257030,"Woodlands Academy",49,9,0.18367346938775511,10,0.20408163265306123,5,0.10204081632653061,8,0.16326530612244897,17,0.34693877551020408,0.74271137026239065,"At risk of severe absence",null,"Special",9257030,"Woodlands Academy",71,14,0.19718309859154928,13,0.18309859154929578,18,0.25352112676056338,8,0.11267605633802817,18,0.25352112676056338,0.78474246841593776,"At risk of severe absence",9257030,"Special",9257030,"Woodlands Academy",64,8,0.125,9,0.140625,9,0.140625,14,0.21875,24,0.375,0.82328398384925972,"Persistent absence"]
[null,null,"Special",9257031,"Fortuna School",80,0,0,5,6.25E-2,10,0.125,10,0.125,55,0.6875,0.94927884615384617,"At risk of persistent absence",null,"Special",9257031,"Fortuna School",80,2,2.5000000000000001E-2,4,0.05,17,0.21249999999999999,15,0.1875,42,0.52500000000000002,0.91261498028909327,"At risk of persistent absence",9257031,"Special",9257031,"Fortuna School",80,2,2.5000000000000001E-2,1,1.2500000000000001E-2,13,0.16250000000000001,18,0.22500000000000001,46,0.57499999999999996,0.92833098056249319,"At risk of persistent absence"]
[null,null,"Special",9257032,"Athena School",84,9,0.10714285714285714,13,0.15476190476190477,12,0.14285714285714285,11,0.13095238095238096,39,0.4642857142857143,0.82783882783882778,"Persistent absence",null,"Special",9257032,"Athena School",109,15,0.13761467889908258,14,0.12844036697247707,24,0.22018348623853212,13,0.11926605504587157,43,0.39449541284403672,0.80952380952380953,"Persistent absence",9257032,"Special",9257032,"Athena School",108,12,0.1111111111111111,10,9.2592592592592587E-2,26,0.24074074074074073,19,0.17592592592592593,41,0.37962962962962965,0.8269527757457531,"Persistent absence"]
[null,null,"Special",9257033,"Mayflower Academy Warren Wood - A Specialist Academy",110,3,2.7272727272727271E-2,15,0.13636363636363635,12,0.10909090909090909,11,0.1,69,0.62727272727272732,0.90455311973018548,"Persistent absence",null,"Special",9257033,"Mayflower Academy Warren Wood - A Specialist Academy",97,0,0,7,7.2164948453608241E-2,27,0.27835051546391754,25,0.25773195876288657,38,0.39175257731958762,0.91430089570365869,"At risk of persistent absence",9257033,"Special",9257033,"Mayflower Academy Warren Wood - A Specialist Academy",97,0,0,2,2.0618556701030927E-2,29,0.29896907216494845,28,0.28865979381443296,38,0.39175257731958762,0.93020981507823608,"At risk of persistent absence"]
[null,null,"Special",9257034,"Mayflower Specialist School Academy Aegir - A Specialist Academy",81,2,2.4691358024691357E-2,5,6.1728395061728392E-2,16,0.19753086419753085,11,0.13580246913580246,47,0.58024691358024694,0.92297111416781297,"At risk of persistent absence",null,"Special",9257034,"Mayflower Specialist School Academy Aegir - A Specialist Academy",111,5,4.5045045045045043E-2,7,6.3063063063063057E-2,33,0.29729729729729731,18,0.16216216216216217,48,0.43243243243243246,0.89583613163196774,"Persistent absence",9257034,"Special",9257034,"Mayflower Specialist School Academy Aegir - A Specialist Academy",109,4,3.669724770642202E-2,4,3.669724770642202E-2,23,0.21100917431192662,22,0.20183486238532111,56,0.51376146788990829,0.90738690287883583,"Persistent absence"]
[null,null,null,null,null,91985,1588,1.7263684296352666E-2,6161,6.6978311681252373E-2,13940,0.15154644779040061,11429,0.12424851878023591,58833,0.63959341196934283,0.93314056922540012,null,null,null,null,null,{"$f":"SUM(W16:W367)","v":94464},{"$f":"SUM(X16:X367)","v":1853},{"$f":"X368/W368","v":1.9615938346883469E-2},{"$f":"SUM(Z16:Z367)","v":5704},{"$f":"Z368/W368","v":6.0382791327913278E-2},{"$f":"SUM(AB16:AB367)","v":18366},{"$f":"AB368/W368","v":0.19442327235772358},{"$f":"SUM(AD16:AD367)","v":19712},{"$f":"AD368/W368","v":0.20867208672086721},{"$f":"SUM(AF16:AF367)","v":48829},{"$f":"AF368/W368","v":0.51690591124661245},0.92259999999999998,null,null,null,null,null,{"$f":"SUM(AN16:AN367)","v":94125},{"$f":"SUM(AO16:AO367)","v":2029},{"$f":"AO368/AN368","v":2.155644090305445E-2},{"$f":"SUM(AQ16:AQ367)","v":4776},{"$f":"AQ368/AN368","v":5.0741035856573705E-2},{"$f":"SUM(AS16:AS367)","v":15189},{"$f":"AS368/AN368","v":0.16137051792828686},{"$f":"SUM(AU16:AU367)","v":18966},{"$f":"AU368/AN368","v":0.2014980079681275},{"$f":"SUM(AW16:AW367)","v":53165},{"$f":"AW368/AN368","v":0.56483399734395745},0.92920000000000003]

{"sheet":"School List","index":5,"n_rows":391,"n_cols":11,"rows_kept":391,"cut":false,"hidden":true,"merged":[]}
["List of open schools in Lincolnshire - Detailed"]
[]
["Click in cell and use drop-down arrow on right to select school","DfE Number","Ofsted  URN","District Name","Post Code","Main Phase","Sub Phase","Intake Type (Secondary Schools Only)","Sixth Form ?","School Type","Open Date"]
["Acorn Free School",9251106,139774,"Countywide","LN5 9TL","PRU / AP","PRU / AP","-","-","Free School - Alternative Provision","2013-09-02"]
["Alford Primary School",9252142,120440,"East Lindsey District Council","LN13 9BJ","Primary","Primary","-","-","Maintained","-"]
["Allington with Sedgebrook Church of England Primary School",9253000,120511,"South Kesteven District Council","NG32 2DY","Primary","Primary","-","-","Maintained","-"]
["Ancaster CofE Primary School",9253001,120512,"South Kesteven District Council","NG32 3QQ","Primary","Primary","-","-","Maintained","-"]
["Aspiration House School",9256058,148189,"Boston Borough Council","PE22 0NX","Not applicable","Not applicable","Special","No","Independent","2021-01-29"]
["Ayscoughfee Hall School",9256020,120731,"South Holland District Council","PE11 2TE","Not applicable","Not applicable",null,"No","Independent","1957-10-28"]
["Barkston and Syston CofE Primary School",9255222,120689,"South Kesteven District Council","NG32 2NB","Primary","Primary","-","-","Maintained","-"]
["Barrowby Church of England Primary School",9253004,120513,"South Kesteven District Council","NG32 1BX","Primary","Primary","-","-","Maintained","-"]
["Bassingham Primary School",9252002,145437,"North Kesteven District Council","LN5 9HQ","Primary","Primary","-","-","Academy","2018-03-01"]
["Baston CE Primary School",9253005,120514,"South Kesteven District Council","PE6 9PB","Primary","Primary","-","-","Maintained","-"]
["Beacon Primary Academy",9252014,139702,"East Lindsey District Council","PE25 2RN","Primary","Primary","-","-","Academy","2014-09-01"]
["Bicker Preparatory School and Early Years",9256041,130283,"Boston Borough Council","PE20 3DW","Not applicable","Not applicable",null,"No","Independent","1996-01-23"]
["Billingborough Primary School",9252003,120371,"South Kesteven District Council","NG34 0NX","Primary","Primary","-","-","Maintained","-"]
["Binbrook CofE Primary School",9253116,120565,"East Lindsey District Council","LN8 6DU","Primary","Primary","-","-","Maintained","-"]
["Blyton Cum Laughton Church of England School",9253350,120619,"West Lindsey District Council","DN21 3JX","Primary","Primary","-","-","Maintained","-"]
["Boston Haven High Academy",9254072,138754,"Boston Borough Council","PE21 9HB","Secondary","Secondary","Selective Area","No","Academy","2012-09-01"]
["Boston Hawthorn Tree School",9252113,120424,"Boston Borough Council","PE21 0PT","Primary","Primary","-","-","Maintained","-"]
["Boston High School",9254022,139140,"Boston Borough Council","PE21 9PF","Secondary","Secondary","Grammar","Yes","Academy","2013-01-01"]
["Boston Nursery School",9251012,126564,"Boston Borough Council","PE21 0LJ","Nursery","Nursery","-","-","Maintained","-"]
["Boston Park Academy",9252237,139191,"Boston Borough Council","PE21 9LQ","Primary","Primary","-","-","Academy","2013-01-01"]
["Boston Pioneers Free School Academy",9252010,139597,"Boston Borough Council","PE21 8SS","Primary","Primary","-","-","Free School","2013-09-03"]
["Boston St Mary's RC Primary Voluntary Academy",9253342,146241,"Boston Borough Council","PE21 9PX","Primary","Primary","-","-","Academy","2018-09-01"]
["Boston St Nicholas CE Primary",9252073,147447,"Boston Borough Council","PE21 0EF","Primary","Primary","-","-","Academy","2019-09-01"]
["Boston St Thomas CofE Primary",9253085,146869,"Boston Borough Council","PE21 7RZ","Primary","Primary","-","-","Academy","2019-04-01"]
["Boston The John Fielding Special School",9257010,142666,"Boston Borough Council","PE21 9PX","Special","Special","-","-","Academy","2016-03-01"]
["Boston Tower Road Academy",9255221,136793,"Boston Borough Council","PE21 9PX","Primary","Primary","-","-","Academy","2011-06-01"]
["Boston West Academy",9252116,138291,"Boston Borough Council","PE21 7QG","Primary","Primary","-","-","Academy","2012-07-01"]
["Bourne Abbey Church of England Primary Academy",9253510,136354,"South Kesteven District Council","PE10 9EP","Primary","Primary","-","-","Academy","2010-12-01"]
["Bourne Academy",9254000,137572,"South Kesteven District Council","PE10 9DT","Secondary","Secondary","Selective Area","Yes","Academy","2011-09-01"]
["Bourne Elsea Park Church of England Primary Academy",9252016,140214,"South Kesteven District Council","PE10 0WP","Primary","Primary","-","-","Academy","2014-09-01"]
["Bourne Grammar School",9254501,137793,"South Kesteven District Council","PE10 9JE","Secondary","Secondary","Grammar","Yes","Academy","2012-01-01"]
["Bourne Westfield Primary Academy",9252072,137599,"South Kesteven District Council","PE10 9QS","Primary","Primary","-","-","Academy","2011-11-01"]
["Bourne Willoughby Academy",9257028,147414,"South Kesteven District Council","PE10 9JD","Special","Special","-","-","Academy","2019-09-01"]
["Bracebridge Heath St John's Primary Academy",9252009,137794,"North Kesteven District Council","LN4 2LD","Primary","Primary","-","-","Academy","2012-01-01"]
["Branston Church of England Infant Academy",9253009,144122,"North Kesteven District Council","LN4 1PR","Primary","Infant","-","-","Academy","2017-07-01"]
["Branston Community Academy",9255418,136358,"North Kesteven District Council","LN4 1LH","Secondary","Secondary","Comprehensive","Yes","Academy","2010-12-01"]
["Branston Junior Academy",9252074,138486,"North Kesteven District Council","LN4 1LH","Primary","Junior","-","-","Academy","2012-08-01"]
["Brant Broughton Church of England and Methodist Primary School",9253163,120594,"North Kesteven District Council","LN5 0RP","Primary","Primary","-","-","Maintained","-"]
["Bridge House Independent School",9256005,139264,"Boston Borough Council","PE21 7NL","Not applicable","Not applicable",null,"Yes","Independent","2013-01-17"]
["Bucknall Primary School",9252146,120443,"East Lindsey District Council","LN10 5DT","Primary","Primary","-","-","Maintained","-"]
["Build-a-Future Independent School",9256009,145932,"East Lindsey District Council","LN9 5PT","Not applicable","Not applicable",null,"No","Independent","2018-08-31"]
["Burgh le Marsh The St Peter and St Paul C of E Primary School",9253118,120566,"East Lindsey District Council","PE24 5ED","Primary","Primary","-","-","Maintained","-"]
["Burton Hathow Preparatory School",9256004,139235,"West Lindsey District Council","LN1 2BB","Not applicable","Not applicable",null,"No","Independent","2013-01-09"]
["Bythams Primary School",9252243,120506,"South Kesteven District Council","NG33 4PX","Primary","Primary","-","-","Maintained","-"]
["Caistor CofE and Methodist Primary School",9253156,120590,"West Lindsey District Council","LN7 6LY","Primary","Primary","-","-","Maintained","-"]
["Caistor Grammar School",9255406,136350,"West Lindsey District Council","LN7 6QJ","Secondary","Secondary","Grammar","Yes","Academy","2010-12-01"]
["Caistor Yarborough Academy",9254049,136958,"West Lindsey District Council","LN7 6QZ","Secondary","Secondary","Selective Area","No","Academy","2011-08-01"]
["Carlton Road Academy",9252234,138751,"Boston Borough Council","PE21 8QX","Primary","Primary","-","-","Academy","2012-09-01"]
["Castle Futures",9256018,147170,"City of Lincoln Council","LN2 2JN","Not applicable","Not applicable",null,"No","Independent","2019-08-12"]
["Castle Wood Academy",9252018,140329,"West Lindsey District Council","DN21 1EH","Primary","Primary","-","-","Academy","2015-09-01"]
["Caythorpe Primary School",9252012,144594,"South Kesteven District Council","NG32 3DR","Primary","Primary","-","-","Academy","2017-12-01"]
["Chapel St Leonards Primary School",9252045,145489,"East Lindsey District Council","PE24 5LS","Primary","Primary","-","-","Academy","2018-03-01"]
["Charles Read Academy",9254017,136479,"South Kesteven District Council","NG33 4NT","Secondary","Secondary","Selective Area","No","Academy","2011-02-01"]
["Cherry Willingham Primary Academy",9252241,146205,"West Lindsey District Council","LN3 4BD","Primary","Primary","-","-","Academy","2019-09-01"]
["Cherry Willingham The Priory Pembroke Academy",9254041,145052,"West Lindsey District Council","LN3 4JP","Secondary","Secondary","Comprehensive","No","Academy","2017-09-01"]
["Coleby Church of England Primary School",9253015,120517,"North Kesteven District Council","LN5 0AJ","Primary","Primary","-","-","Maintained","-"]
["Coningsby St Michael's Church of England Primary School",9253119,145527,"East Lindsey District Council","LN4 4SJ","Primary","Primary","-","-","Academy","2018-03-01"]
["Copthill Independent Day School & Nursery",9256035,120741,"South Kesteven District Council","PE9 3AD","Not applicable","Not applicable",null,"No","Independent","1987-03-25"]
["Corby Glen Community Primary School",9252013,120374,"South Kesteven District Council","NG33 4NW","Primary","Primary","-","-","Maintained","-"]
["Corringham CofE Primary School",9253120,120568,"West Lindsey District Council","DN21 5QS","Primary","Primary","-","-","Maintained","-"]
["Cowley Academy",9254057,138755,"South Holland District Council","PE11 4TF","Secondary","Secondary","Selective Area","No","Academy","2012-09-01"]
["Cranwell Primary School",9255207,120674,"North Kesteven District Council","NG34 8HH","Primary","Primary","-","-","Maintained","-"]
["Crowland South View Community Primary School",9252084,120406,"South Holland District Council","PE6 0JA","Primary","Primary","-","-","Maintained","-"]
["Deeping St James Community Primary School",9252062,120396,"South Kesteven District Council","PE6 8PZ","Primary","Primary","-","-","Maintained","-"]
["Deeping St James Linchfield Academy",9252079,147677,"South Kesteven District Council","PE6 8EY","Primary","Primary","-","-","Academy","2020-09-01"]
["Deeping St Nicholas Primary School",9252085,120407,"South Holland District Council","PE11 3DG","Primary","Primary","-","-","Maintained","-"]
["Denton CofE School",9253017,120518,"South Kesteven District Council","NG32 1LG","Primary","Primary","-","-","Maintained","-"]
["Digby Church of England School",9253018,120519,"North Kesteven District Council","LN4 3LZ","Primary","Primary","-","-","Maintained","-"]
["Digby The Tedder Primary School",9252017,120375,"North Kesteven District Council","LN4 3JY","Primary","Primary","-","-","Maintained","-"]
["Dudley House School",9256016,120728,"South Kesteven District Council","NG31 9AA","Not applicable","Not applicable",null,"No","Independent","1966-09-27"]
["Dunholme St Chad's Church of England Primary School",9253121,120569,"West Lindsey District Council","LN2 3NE","Primary","Primary","-","-","Maintained","-"]
["Dunston St Peter's Church of England Primary School",9253021,120520,"North Kesteven District Council","LN4 2EH","Primary","Primary","-","-","Maintained","-"]
["Eagle Community Primary School",9252019,120376,"North Kesteven District Council","LN6 9EJ","Primary","Primary","-","-","Maintained","-"]
["Faldingworth Community Primary School",9252151,120445,"West Lindsey District Council","LN8 3SF","Primary","Primary","-","-","Maintained","-"]
["Fishtoft Academy",9252007,139266,"Boston Borough Council","PE21 0SF","Primary","Primary","-","-","Academy","2013-02-01"]
["Fiskerton Church of England Primary School",9253122,120570,"West Lindsey District Council","LN3 4HU","Primary","Primary","-","-","Maintained","-"]
["Fleet Wood Lane School",9252087,120408,"South Holland District Council","PE12 8NN","Primary","Primary","-","-","Maintained","-"]
["Friskney All Saints Church of England (Aided) Primary School",9253353,148405,"East Lindsey District Council","PE22 8RD","Primary","Primary","-","-","Academy","2021-05-01"]
["Frithville Primary School",9252152,146586,"East Lindsey District Council","PE22 7EX","Primary","Primary","-","-","Academy","2018-12-01"]
["Fulstow Community Primary School",9252153,120447,"East Lindsey District Council","LN11 0XL","Primary","Primary","-","-","Maintained","-"]
["Gainsborough Benjamin Adlard Primary School",9252247,138063,"West Lindsey District Council","DN21 1DB","Primary","Primary","-","-","Academy","2012-04-01"]
["Gainsborough St George's Church of England Community Primary School",9253169,131490,"West Lindsey District Council","DN21 1YN","Primary","Primary","-","-","Maintained","-"]
["Gainsborough The Queen Elizabeth's High School",9254065,120655,"West Lindsey District Council","DN21 2ST","Secondary","Secondary","Grammar","Yes","Maintained","-"]
["Gedney Church End Primary School",9252088,120409,"South Holland District Council","PE12 0BU","Primary","Primary","-","-","Maintained","-"]
["Gedney Drove End Primary School",9252089,120410,"South Holland District Council","PE12 9PD","Primary","Primary","-","-","Maintained","-"]
["George Johnson Education Centre",9256021,147221,"North Kesteven District Council","LN6 3QN","Not applicable","Not applicable",null,"No","Independent","2019-08-30"]
["Gipsey Bridge Academy",9252157,139296,"East Lindsey District Council","PE22 7BP","Primary","Primary","-","-","Academy","2013-02-01"]
["Good Apple Independent School",9256007,145023,"West Lindsey District Council","DN21 2NS","Not applicable","Not applicable",null,"No","Independent","2017-11-28"]
["Gosberton Academy",9252043,144491,"South Holland District Council","PE11 4NW","Primary","Primary","-","-","Academy","2016-11-01"]
["Gosberton Clough and Risegate Community Primary School",9252091,120412,"South Holland District Council","PE11 4JP","Primary","Primary","-","-","Maintained","-"]
["Gosberton House Academy",9257008,143257,"South Holland District Council","PE11 4EW","Special","Special","-","-","Academy","2016-09-01"]
["Grainthorpe Junior School",9252158,120450,"East Lindsey District Council","LN11 7JY","Primary","Junior","-","-","Maintained","-"]
["Grantham Ambergate Sports College",9257002,141253,"South Kesteven District Council","NG31 7LP","Special","Special","-","-","Academy","2014-09-01"]
["Grantham Belmont Community Primary School",9252070,120401,"South Kesteven District Council","NG31 9LR","Primary","Primary","-","-","Maintained","-"]
["Grantham Belton Lane Community Primary School",9252054,120392,"South Kesteven District Council","NG31 9PP","Primary","Primary","-","-","Maintained","-"]
["Grantham Cliffedale Primary School",9252055,120393,"South Kesteven District Council","NG31 8DP","Primary","Primary","-","-","Maintained","-"]
["Grantham Esland Isaac Newton School",9256055,147703,"South Kesteven District Council","NG31 9RT","Not applicable","Not applicable","Special","No","Independent","2020-08-18"]
["Grantham Greenfields Academy",9257029,139316,"South Kesteven District Council","NG31 7US","Special","Special","-","-","Academy","2013-03-01"]
["Grantham Huntingtower Community Primary Academy",9252020,139618,"South Kesteven District Council","NG31 7AU","Primary","Primary","-","-","Academy","2013-05-01"]
["Grantham Kesteven and Grantham Girls' School",9254004,138638,"South Kesteven District Council","NG31 9AU","Secondary","Secondary","Grammar","Yes","Academy","2012-09-01"]
["Grantham Poplar Farm School",9252048,145902,"South Kesteven District Council","NG31 8XF","Primary","Primary","-","-","Free School","2018-09-04"]
["Grantham Preparatory International School",9256031,120738,"South Kesteven District Council","NG31 7UF","Not applicable","Not applicable",null,"No","Independent","1981-10-14"]
["Grantham Springwell Alternative Academy",9251119,147197,"South Kesteven District Council","NG31 9LD","PRU / AP","PRU / AP","-","-","Free School - Alternative Provision","2019-06-10"]
["Grantham St Anne's Church of England Primary School",9253026,120522,"South Kesteven District Council","NG31 9ED","Primary","Primary","-","-","Maintained","-"]
["Grantham The Gonerby Hill Foot Church of England Primary School",9253029,120524,"South Kesteven District Council","NG31 8HQ","Primary","Primary","-","-","Maintained","-"]
["Grantham The Harrowby Church of England Infant School",9253310,138283,"South Kesteven District Council","NG31 9LJ","Primary","Infant","-","-","Academy","2012-07-01"]
["Grantham The Isaac Newton Primary School",9252024,141100,"South Kesteven District Council","NG31 7DG","Primary","Primary","-","-","Academy","2014-12-01"]
["Grantham The King's School",9255402,137166,"South Kesteven District Council","NG31 6RP","Secondary","Secondary","Grammar","Yes","Academy","2011-08-01"]
["Grantham The Little Gonerby Church of England Infant School",9253311,138816,"South Kesteven District Council","NG31 9AZ","Primary","Infant","-","-","Academy","2012-10-01"]
["Grantham St Wulfrums Church of England Primary School",9253308,138282,"South Kesteven District Council","NG31 6SR","Primary","Junior","-","-","Academy","2012-07-01"]
["Grantham The Saint Mary's Catholic Voluntary Academy",9253330,146226,"South Kesteven District Council","NG31 9AX","Primary","Primary","-","-","Academy","2018-09-01"]
["Grantham Walton Academy",9254019,136624,"South Kesteven District Council","NG31 7JR","Secondary","Secondary","Selective Area","Yes","Academy","2011-04-01"]
["Grantham Wyndham Park Nursery School",9251001,120364,"South Kesteven District Council","NG31 9BB","Nursery","Nursery","-","-","Maintained","-"]
["Grasby All Saints Church of England Primary School",9253123,120571,"West Lindsey District Council","DN38 6AU","Primary","Primary","-","-","Maintained","-"]
["Great Gonerby The St Sebastian's Church of England Primary School",9253313,120601,"South Kesteven District Council","NG31 8LB","Primary","Primary","-","-","Maintained","-"]
["Great Ponton Church of England School",9253314,120602,"South Kesteven District Council","NG33 5DT","Primary","Primary","-","-","Maintained","-"]
["Great Steeping Primary School",9252159,120451,"East Lindsey District Council","PE23 5PT","Primary","Primary","-","-","Maintained","-"]
["Greenwich House School",9256038,120743,"East Lindsey District Council","LN11 0HE","Not applicable","Not applicable",null,"No","Independent","1990-10-31"]
["Grimoldby Primary School",9255217,120684,"East Lindsey District Council","LN11 8SW","Primary","Primary","-","-","Maintained","-"]
["Halton Holegate CofE Primary School",9253125,120573,"East Lindsey District Council","PE23 5PB","Primary","Primary","-","-","Maintained","-"]
["Handel House Preparatory School",9256023,120733,"West Lindsey District Council","DN21 2JB","Not applicable","Not applicable",null,"No","Independent","1957-10-18"]
["Heckington St Andrew's Church of England School",9253033,120526,"North Kesteven District Council","NG34 9RX","Primary","Primary","-","-","Maintained","-"]
["Heighington Millfield Primary Academy",9252075,137201,"North Kesteven District Council","LN4 1RQ","Primary","Primary","-","-","Academy","2011-08-01"]
["Helpringham School",9252025,120379,"North Kesteven District Council","NG34 0RD","Primary","Primary","-","-","Maintained","-"]
["Hemswell Cliff Primary School",9252210,120491,"West Lindsey District Council","DN21 5XS","Primary","Primary","-","-","Maintained","-"]
["Hogsthorpe Primary Academy",9252161,138749,"East Lindsey District Council","PE24 5PT","Primary","Primary","-","-","Academy","2012-09-01"]
["Holbeach Bank Primary Academy",9252047,145734,"South Holland District Council","PE12 8BX","Primary","Primary","-","-","Academy","2018-06-01"]
["Holbeach Primary Academy",9252093,141260,"South Holland District Council","PE12 7LZ","Primary","Primary","-","-","Academy","2014-09-01"]
["Holton le Clay Infant School",9252162,120453,"East Lindsey District Council","DN36 5AQ","Primary","Infant","-","-","Maintained","-"]
["Holton Sleaford Independent School",9256059,148356,"North Kesteven District Council","NG34 7DT","Not applicable","Not applicable","Special","No","Independent","2021-02-12"]
["Holton-Le-Clay Junior School",9252229,120497,"East Lindsey District Council","DN36 5DR","Primary","Junior","-","-","Maintained","-"]
["Horbling Brown's Church of England Primary School",9253317,143258,"South Kesteven District Council","NG34 0PL","Primary","Primary","-","-","Academy","2016-09-01"]
["Horncastle Community Primary School",9252244,120507,"East Lindsey District Council","LN9 5EH","Primary","Primary","-","-","Maintained","-"]
["Horncastle Queen Elizabeth's Grammar School",9255411,138665,"East Lindsey District Council","LN9 5AD","Secondary","Secondary","Grammar","Yes","Academy","2012-09-01"]
["Horncastle The Banovallum School",9254050,141581,"East Lindsey District Council","LN9 6DA","Secondary","Secondary","Selective Area","No","Academy","2014-12-01"]
["Huttoft Primary School",9255209,138808,"East Lindsey District Council","LN13 9RE","Primary","Primary","-","-","Academy","2012-10-01"]
["Hykeham Manor Farm Academy",9252036,141556,"North Kesteven District Council","LN6 9ST","Primary","Primary","-","-","Academy","2016-09-01"]
["Ingham Primary School",9252166,120454,"West Lindsey District Council","LN1 2XT","Primary","Primary","-","-","Maintained","-"]
["Ingoldmells Academy",9252004,138444,"East Lindsey District Council","PE25 1QE","Primary","Primary","-","-","Academy","2012-09-01"]
["Ingoldsby Academy",9252035,141390,"South Kesteven District Council","NG33 4HA","Primary","Primary","-","-","Academy","2015-03-01"]
["John Spendluffe Foundation Technology College",9254048,136968,"East Lindsey District Council","LN13 9BL","Secondary","Secondary","Selective Area","No","Academy","2011-08-01"]
["Keelby Primary Academy",9252168,141793,"West Lindsey District Council","DN41 8EF","Primary","Primary","-","-","Academy","2015-03-01"]
["Kelsey Primary School",9252182,120469,"West Lindsey District Council","LN7 6EJ","Primary","Primary","-","-","Maintained","-"]
["Kesteven and Sleaford High School Selective Academy",9254005,137667,"North Kesteven District Council","NG34 7RS","Secondary","Secondary","Grammar","Yes","Academy","2011-11-01"]
["Kirkstone House School",9256017,120729,"South Kesteven District Council","PE6 9PA","Not applicable","Not applicable",null,"Yes","Independent","1967-05-02"]
["Kirton Primary School",9252094,120415,"Boston Borough Council","PE20 1HY","Primary","Primary","-","-","Maintained","-"]
["Kisimul School",9256034,120740,"North Kesteven District Council","LN6 9LU","Not applicable","Not applicable",null,"Yes","Independent","1977-10-10"]
["Langtoft Primary School",9252028,120381,"South Kesteven District Council","PE6 9NB","Primary","Primary","-","-","Maintained","-"]
["Lea Frances Olive Anderson Church of England Primary School",9253361,120625,"West Lindsey District Council","DN21 5EP","Primary","Primary","-","-","Maintained","-"]
["Leadenham Church of England Primary School",9253319,120604,"North Kesteven District Council","LN5 0QB","Primary","Primary","-","-","Maintained","-"]
["Legbourne East Wold Church of England Primary School",9253168,120597,"East Lindsey District Council","LN11 8LD","Primary","Primary","-","-","Maintained","-"]
["Legsby Primary School",9252169,120457,"West Lindsey District Council","LN8 3QW","Primary","Primary","-","-","Maintained","-"]
["Lincoln Athena School",9257032,131277,"City of Lincoln Council","LN5 8EL","Special","Special","-","-","Maintained","-"]
["Lincoln Birchwood Junior School",9252245,120508,"City of Lincoln Council","LN6 0NL","Primary","Junior","-","-","Maintained","-"]
["Lincoln Bracebridge Infant and Nursery School",9252122,139142,"City of Lincoln Council","LN5 8QG","Primary","Infant","-","-","Academy","2013-01-01"]
["Lincoln Carlton Academy",9252006,138970,"City of Lincoln Council","LN2 4AG","Primary","Primary","-","-","Academy","2013-10-01"]
["Lincoln Castle Academy",9255407,136537,"City of Lincoln Council","LN1 3SP","Secondary","Secondary","Comprehensive","Yes","Academy","2011-04-01"]
["Lincoln Christ's Hospital School",9255408,137447,"City of Lincoln Council","LN2 4PN","Secondary","Secondary","Comprehensive","Yes","Academy","2011-09-01"]
["Lincoln Ermine Primary Academy",9252078,147530,"City of Lincoln Council","LN2 2HG","Primary","Primary","-","-","Academy","2019-09-01"]
["Lincoln Fortuna School",9257031,134229,"City of Lincoln Council","LN6 0FB","Special","Special","-","-","Maintained","-"]
["Lincoln Hartsholme Academy",9252058,146559,"City of Lincoln Council","LN6 0DE","Primary","Primary","-","-","Academy","2018-11-01"]
["Lincoln Leslie Manser Primary School",9252246,120509,"City of Lincoln Council","LN6 0FB","Primary","Primary","-","-","Maintained","-"]
["Lincoln Minster School",9256012,120724,"City of Lincoln Council","LN2 5RW","Not applicable","Not applicable",null,"Yes","Independent","1951-12-18"]
["Lincoln Monks Abbey Primary School",9252124,120429,"City of Lincoln Council","LN2 5PF","Primary","Primary","-","-","Maintained","-"]
["Lincoln Mount Street Academy",9255227,137551,"City of Lincoln Council","LN1 3JG","Primary","Infant","-","-","Academy","2011-10-01"]
["Lincoln Our Lady of Lincoln Catholic Primary School",9253347,139622,"City of Lincoln Council","LN2 2HE","Primary","Primary","-","-","Academy","2013-05-01"]
["Lincoln Sir Francis Hill Community Primary School",9252120,120427,"City of Lincoln Council","LN6 7UE","Primary","Primary","-","-","Maintained","-"]
["Lincoln Springwell Alternative Academy",9251117,147195,"City of Lincoln Council","LN2 4EL","PRU / AP","PRU / AP","-","-","Free School - Alternative Provision","2019-06-10"]
["Lincoln The Kingsdown Nursery School",9251010,126562,"City of Lincoln Council","LN6 0FB","Nursery","Nursery","-","-","Maintained","-"]
["Lincoln The Lancaster School",9255219,120686,"City of Lincoln Council","LN6 0QQ","Primary","Infant","-","-","Maintained","-"]
["Lincoln The Meadows Primary School",9253507,132179,"City of Lincoln Council","LN5 9BB","Primary","Primary","-","-","Maintained","-"]
["Lincoln The Pilgrim School",9257012,120753,"Countywide","LN6 0DE","Special","Special","-","-","Maintained","-"]
["Lincoln The Priory Academy LSST",9256907,135565,"City of Lincoln Council","LN5 8PW","Secondary","Secondary","Comprehensive","Yes","Academy","2008-09-01"]
["Lincoln The Priory City of Lincoln Academy",9256906,135564,"City of Lincoln Council","LN6 0EP","Secondary","Secondary","Comprehensive","Yes","Academy","2008-09-01"]
["Lincoln The Priory Witham Academy",9256905,135563,"City of Lincoln Council","LN6 7DT","All-Through","All-Through","Comprehensive","Yes","Academy","2008-09-01"]
["Lincoln The Saint Hugh's Catholic Primary Voluntary Academy",9253346,139627,"City of Lincoln Council","LN6 0SH","Primary","Primary","-","-","Academy","2013-05-01"]
["Lincoln The St Faith and St Martin Church of England Junior School",9253107,120561,"City of Lincoln Council","LN1 1LW","Primary","Junior","-","-","Maintained","-"]
["Lincoln The St Faith's Church of England Infant and Nursery School",9253108,120562,"City of Lincoln Council","LN1 1QS","Primary","Infant","-","-","Maintained","-"]
["Lincoln The St Francis Special School",9257016,120755,"City of Lincoln Council","LN1 3TJ","Special","Special","-","-","Maintained","-"]
["Lincoln UTC",9254008,140950,"City of Lincoln Council","LN2 1PF","Secondary","Secondary","Comprehensive","Yes","Free School","2014-09-01"]
["Lincoln Westgate Academy",9255224,137451,"City of Lincoln Council","LN1 3BQ","Primary","Junior","-","-","Academy","2011-09-01"]
["Lincoln Woodlands Infant and Nursery School",9252135,120436,"City of Lincoln Council","LN6 0PF","Primary","Infant","-","-","Maintained","-"]
["Long Bennington Church of England Academy",9253040,138057,"South Kesteven District Council","NG23 5EH","Primary","Primary","-","-","Academy","2012-04-01"]
["Long Sutton County Primary School",9252095,147566,"South Holland District Council","PE12 9EP","Primary","Primary","-","-","Academy","2019-11-01"]
["Louth Academy",9254039,144968,"East Lindsey District Council","LN11 9AW","Secondary","Secondary","Selective Area","No","Academy","2017-09-01"]
["Louth Eastfield Infants and Nursery Academy",9252170,146505,"East Lindsey District Council","LN11 8DQ","Primary","Infant","-","-","Academy","2018-11-01"]
["Louth Kidgate Primary Academy",9252171,138637,"East Lindsey District Council","LN11 9BX","Primary","Primary","-","-","Academy","2012-09-01"]
["Louth King Edward VI Grammar School",9255405,142262,"East Lindsey District Council","LN11 9LL","Secondary","Secondary","Grammar","Yes","Academy","2015-09-01"]
["Louth Lacey Gardens Junior Academy",9255206,146499,"East Lindsey District Council","LN11 8DH","Primary","Junior","-","-","Academy","2018-11-01"]
["Louth St Michael's Church of England School",9253128,120574,"East Lindsey District Council","LN11 9AR","Primary","Primary","-","-","Maintained","-"]
["Lutton St Nicholas Primary School",9252105,120421,"South Holland District Council","PE12 9HN","Primary","Primary","-","-","Maintained","-"]
["Mablethorpe Primary Academy",9252005,138445,"East Lindsey District Council","LN12 1EW","Primary","Primary","-","-","Academy","2012-09-01"]
["Mablethorpe Springwell Alternative Academy",9251118,147196,"East Lindsey District Council","LN12 2DF","PRU / AP","PRU / AP","-","-","Free School - Alternative Provision","2019-09-02"]
["Market Deeping Community Primary School",9252065,120398,"South Kesteven District Council","PE6 8JE","Primary","Primary","-","-","Maintained","-"]
["Market Deeping William Hildyard Church of England Primary and Nursery School",9255228,120695,"South Kesteven District Council","PE6 8HZ","Primary","Primary","-","-","Maintained","-"]
["Market Rasen De Aston School",9254514,136491,"West Lindsey District Council","LN8 3RF","Secondary","Secondary","Comprehensive","Yes","Academy","2011-03-01"]
["Marshchapel Infant School",9252174,120461,"East Lindsey District Council","DN36 5SX","Primary","Infant","-","-","Maintained","-"]
["Martin Mrs Mary King's CofE Primary School",9253041,120530,"North Kesteven District Council","LN4 3RB","Primary","Primary","-","-","Maintained","-"]
["Mayflower Academy Warren Wood - A Specialist Academy",9257033,142168,"West Lindsey District Council","DN21 1PU","Special","Special","-","-","Academy","2015-07-01"]
["Mayflower Specialist School Academy Aegir - A Specialist Academy",9257034,142136,"West Lindsey District Council","DN21 1PB","Special","Special","-","-","Academy","2015-07-01"]
["Mercer's Wood Academy",9252008,139332,"West Lindsey District Council","DN21 2PD","Primary","Primary","-","-","Academy","2013-03-01"]
["Morton Trentside Primary School",9252177,120464,"West Lindsey District Council","DN21 3AH","Primary","Primary","-","-","Maintained","-"]
["Moulton Chapel Primary School",9252096,120417,"South Holland District Council","PE12 0XJ","Primary","Primary","-","-","Maintained","-"]
["Moulton The John Harrox Primary School",9252097,120418,"South Holland District Council","PE12 6PN","Primary","Primary","-","-","Maintained","-"]
["Navenby Church of England Primary School",9253045,120532,"North Kesteven District Council","LN5 0EP","Primary","Primary","-","-","Maintained","-"]
["Nettleton Community Primary School",9252178,120465,"West Lindsey District Council","LN7 6AA","Primary","Primary","-","-","Maintained","-"]
["New York Primary School",9252180,146597,"East Lindsey District Council","LN4 4XH","Primary","Primary","-","-","Academy","2018-12-01"]
["Newton-on-Trent CofE Primary School",9253132,120578,"West Lindsey District Council","LN1 2JS","Primary","Primary","-","-","Maintained","-"]
["Nocton Community Primary School",9252031,120383,"North Kesteven District Council","LN4 2BJ","Primary","Primary","-","-","Maintained","-"]
["Normanby Primary School",9252181,120468,"West Lindsey District Council","LN8 2HE","Primary","Primary","-","-","Maintained","-"]
["North Cockerington Church of England Primary School",9253134,120580,"East Lindsey District Council","LN11 7EP","Primary","Primary","-","-","Maintained","-"]
["North Hykeham Fosse Way Academy",9252057,136790,"North Kesteven District Council","LN6 8DU","Primary","Primary","-","-","Academy","2011-06-01"]
["North Hykeham Ling Moor Primary Academy",9252064,138748,"North Kesteven District Council","LN6 8QZ","Primary","Primary","-","-","Academy","2012-09-01"]
["North Hykeham North Kesteven Academy",9255412,136871,"North Kesteven District Council","LN6 9AG","Secondary","Secondary","Comprehensive","Yes","Academy","2011-07-01"]
["North Hykeham Sir Robert Pattinson Academy",9255413,137135,"North Kesteven District Council","LN6 9AF","Secondary","Secondary","Comprehensive","Yes","Academy","2011-08-01"]
["North Scarle Primary School",9252033,120385,"North Kesteven District Council","LN6 9EY","Primary","Primary","-","-","Maintained","-"]
["North Somercotes CofE Primary School",9255225,120692,"East Lindsey District Council","LN11 7QB","Primary","Primary","-","-","Maintained","-"]
["North Thoresby Primary Academy",9252183,139868,"East Lindsey District Council","DN36 5PL","Primary","Primary","-","-","Academy","2013-07-01"]
["Osbournby Primary School",9252034,120386,"North Kesteven District Council","NG34 0DG","Primary","Primary","-","-","Maintained","-"]
["Osgodby Primary School",9252185,120471,"West Lindsey District Council","LN8 3TA","Primary","Primary","-","-","Maintained","-"]
["Partney Church of England Aided Primary School",9253366,120627,"East Lindsey District Council","PE23 4PX","Primary","Primary","-","-","Maintained","-"]
["Pinchbeck St Bartholomews CofE Primary School",9253092,120551,"South Holland District Council","PE11 3QJ","Primary","Primary","-","-","Maintained","-"]
["Pointon The St Gilbert of Sempringham Church of England Primary School",9253322,120606,"South Kesteven District Council","NG34 0NA","Primary","Primary","-","-","Maintained","-"]
["Quadring Cowley & Brown's Primary School",9253093,120552,"South Holland District Council","PE11 4SQ","Primary","Primary","-","-","Maintained","-"]
["Queen Elizabeth's Grammar Alford - A Selective Academy",9255401,136315,"East Lindsey District Council","LN13 9HY","Secondary","Secondary","Grammar","Yes","Academy","2010-10-01"]
["Rauceby Church of England Primary School",9255202,138284,"North Kesteven District Council","NG34 8QW","Primary","Primary","-","-","Academy","2012-07-01"]
["Reepham Church of England Primary School",9253136,120581,"West Lindsey District Council","LN3 4DP","Primary","Primary","-","-","Maintained","-"]
["Ruskington Chestnut Street Church of England Academy",9255226,138324,"North Kesteven District Council","NG34 9DL","Primary","Primary","-","-","Academy","2012-07-01"]
["Ruskington Winchelsea Primary School",9252224,120496,"North Kesteven District Council","NG34 9BY","Primary","Primary","-","-","Maintained","-"]
["Saxilby Church of England Primary School",9253139,120583,"West Lindsey District Council","LN1 2QJ","Primary","Primary","-","-","Maintained","-"]
["Scamblesby Church of England Primary School",9253140,120584,"East Lindsey District Council","LN11 9XG","Primary","Primary","-","-","Maintained","-"]
["Scampton Church of England Primary School",9253141,120585,"West Lindsey District Council","LN1 2SD","Primary","Primary","-","-","Maintained","-"]
["Scampton Pollyplatt Primary School",9252187,120472,"West Lindsey District Council","LN1 2TP","Primary","Primary","-","-","Maintained","-"]
["Scothern Ellison Boulters Church of England Primary School",9253166,138753,"West Lindsey District Council","LN2 2UZ","Primary","Primary","-","-","Academy","2012-09-01"]
["Scotter Primary School",9252188,120473,"West Lindsey District Council","DN21 3RY","Primary","Primary","-","-","Maintained","-"]
["Seathorne Primary Academy",9252191,147412,"East Lindsey District Council","PE25 1HB","Primary","Primary","-","-","Academy","2019-09-01"]
["Shepeau Stow Primary School",9252107,120422,"South Holland District Council","PE12 0TX","Primary","Primary","-","-","Maintained","-"]
["Sir William Robertson Academy",9255420,138839,"North Kesteven District Council","LN5 0PA","Secondary","Secondary","Selective Area","Yes","Academy","2012-10-01"]
["Skegness Academy",9256911,136217,"East Lindsey District Council","PE25 2QH","Secondary","Secondary","Selective Area","Yes","Academy","2010-09-01"]
["Skegness Grammar School",9255400,138757,"East Lindsey District Council","PE25 2QS","Secondary","Secondary","Grammar","Yes","Academy","2012-09-01"]
["Skegness Infant Academy",9252190,138750,"East Lindsey District Council","PE25 2QU","Primary","Infant","-","-","Academy","2012-09-01"]
["Skegness Junior Academy",9252000,138442,"East Lindsey District Council","PE25 2QX","Primary","Junior","-","-","Academy","2012-09-01"]
["Skegness The Richmond School",9252219,120494,"East Lindsey District Council","PE25 3SH","Primary","Primary","-","-","Maintained","-"]
["Skellingthorpe St Lawrence Church of England Primary School",9253056,120537,"North Kesteven District Council","LN6 5UZ","Primary","Primary","-","-","Maintained","-"]
["Skellingthorpe The Holt Primary School",9252067,120400,"North Kesteven District Council","LN6 5XJ","Primary","Primary","-","-","Maintained","-"]
["Sleaford Carre's Grammar School",9255403,137213,"North Kesteven District Council","NG34 7DD","Secondary","Secondary","Grammar","Yes","Academy","2011-08-01"]
["Sleaford Church Lane Primary School & Nursery",9252038,120387,"North Kesteven District Council","NG34 7DF","Primary","Primary","-","-","Maintained","-"]
["Sleaford Our Lady of Good Counsel Catholic Primary School",9253331,139621,"North Kesteven District Council","NG34 7AT","Primary","Primary","-","-","Academy","2013-05-01"]
["Sleaford St Botolph's C of E Primary School",9252248,132251,"North Kesteven District Council","NG34 7FE","Primary","Primary","-","-","Maintained","-"]
["Sleaford William Alvey School",9255203,137565,"North Kesteven District Council","NG34 7EA","Primary","Primary","-","-","Academy","2011-10-01"]
["Somercotes Academy",9254018,142392,"East Lindsey District Council","LN11 7PN","Secondary","Secondary","Selective Area","No","Academy","2015-11-01"]
["South Witham Academy",9252042,143518,"South Kesteven District Council","NG33 5PH","Primary","Primary","-","-","Academy","2016-11-01"]
["Spalding Academy",9254035,144488,"South Holland District Council","PE11 2EJ","Secondary","Secondary","Selective Area","No","Academy","2016-09-01"]
["Spalding Grammar School",9254603,139304,"South Holland District Council","PE11 2XH","Secondary","Secondary","Grammar","Yes","Academy","2013-02-01"]
["Spalding High School",9254027,120642,"South Holland District Council","PE11 2PJ","Secondary","Secondary","Grammar","Yes","Maintained","-"]
["Spalding Primary Academy",9255211,148373,"South Holland District Council","PE11 1PB","Primary","Primary","-","-","Academy","2021-03-01"]
["Spalding Springwell Alternative Academy",9251112,144763,"South Holland District Council","PE11 2PN","PRU / AP","PRU / AP","-","-","Free School - Alternative Provision","2019-04-01"]
["Spalding St Norbert's Catholic Voluntary Academy",9253343,146257,"South Holland District Council","PE11 1NJ","Primary","Primary","-","-","Academy","2018-09-01"]
["Spalding St Paul's Community Primary and Nursery School",9252080,147727,"South Holland District Council","PE11 2JQ","Primary","Primary","-","-","Academy","2020-02-01"]
["Spalding The Garth School",9257011,142665,"South Holland District Council","PE11 1QF","Special","Special","-","-","Academy","2016-03-01"]
["Spilsby King Edward VI Academy",9254002,138783,"East Lindsey District Council","PE23 5EW","Secondary","Secondary","Selective Area","No","Academy","2012-09-01"]
["Spilsby Primary School",9252193,142764,"East Lindsey District Council","PE23 5EP","Primary","Primary","-","-","Academy","2016-04-01"]
["St Bernard's School, Louth",9257025,142309,"East Lindsey District Council","LN11 8RS","Special","Special","-","-","Academy","2015-09-01"]
["St George's Academy",9256909,136044,"North Kesteven District Council","NG34 7PP","Secondary","Secondary","Selective Area","Yes","Academy","2010-01-01"]
["St George's Preparatory School & Little Dragons Preschool",9256000,137327,"Boston Borough Council","PE21 7HB","Not applicable","Not applicable",null,"No","Independent","2011-08-23"]
["St Giles Academy",9252063,146561,"City of Lincoln Council","LN2 4LQ","Primary","Primary","-","-","Academy","2018-11-01"]
["St Hugh's School",9256022,120732,"East Lindsey District Council","LN10 6TQ","Not applicable","Not applicable",null,"No","Independent","1931-01-01"]
["St Peter and St Paul, Catholic Voluntary Academy",9255421,139623,"City of Lincoln Council","LN6 7SX","Secondary","Secondary","Comprehensive","Yes","Academy","2013-05-01"]
["Stamford Endowed Schools",9256027,120735,"South Kesteven District Council","PE9 2BE","Not applicable","Not applicable",null,"Yes","Independent","1980-09-30"]
["Stamford Junior School",9256045,132760,"South Kesteven District Council","PE9 2LR","Not applicable","Not applicable",null,"No","Independent","2000-10-30"]
["Stamford Malcolm Sargent Primary School",9255205,137680,"South Kesteven District Council","PE9 2SR","Primary","Primary","-","-","Academy","2011-12-01"]
["Stamford St George's Church of England Primary School",9253325,120607,"South Kesteven District Council","PE9 1SX","Primary","Primary","-","-","Maintained","-"]
["Stamford St Gilberts Church of England Primary School",9253077,139178,"South Kesteven District Council","PE9 2PP","Primary","Primary","-","-","Academy","2013-01-01"]
["Stamford The Bluecoat School",9252066,148371,"South Kesteven District Council","PE9 1HE","Primary","Primary","-","-","Academy","2021-01-01"]
["Stamford The Saint Augustine's Catholic Voluntary Academy",9253332,139626,"South Kesteven District Council","PE9 1SR","Primary","Primary","-","-","Academy","2013-05-01"]
["Stamford Welland Academy",9254067,137600,"South Kesteven District Council","PE9 1HE","Secondary","Secondary","Selective Area","Yes","Academy","2011-11-01"]
["Staniland Academy",9252239,138752,"Boston Borough Council","PE21 8DF","Primary","Primary","-","-","Academy","2012-09-01"]
["Stickney Church of England Primary School",9253171,120629,"East Lindsey District Council","PE22 8AX","Primary","Primary","-","-","Maintained","-"]
["Sturton by Stow Primary School",9252195,120478,"West Lindsey District Council","LN1 2BY","Primary","Primary","-","-","Maintained","-"]
["Surfleet Primary School",9252086,148392,"South Holland District Council","PE11 4DB","Primary","Primary","-","-","Academy","2021-03-01"]
["Sutterton The Fourfields Church of England School",9253103,120559,"Boston Borough Council","PE20 2JN","Primary","Primary","-","-","Maintained","-"]
["Sutton Bridge Westmere Community Primary School",9252238,120502,"South Holland District Council","PE12 9TB","Primary","Primary","-","-","Maintained","-"]
["Sutton St James Community Primary School",9252104,120420,"South Holland District Council","PE12 0JG","Primary","Primary","-","-","Maintained","-"]
["Sutton-on-Sea Community Primary School",9252196,120479,"East Lindsey District Council","LN12 2HU","Primary","Primary","-","-","Maintained","-"]
["Swinderby All Saints Church of England Primary School",9253066,120539,"North Kesteven District Council","LN6 9LU","Primary","Primary","-","-","Maintained","-"]
["Swineshead St Mary's Church of England Primary School",9253102,120558,"Boston Borough Council","PE20 3EN","Primary","Primary","-","-","Maintained","-"]
["Tattershall Holy Trinity Church of England Primary School",9253146,145436,"East Lindsey District Council","LN4 4LD","Primary","Primary","-","-","Academy","2018-04-01"]
["Tattershall The Barnes Wallis Academy",9254011,141166,"East Lindsey District Council","LN4 4PN","Secondary","Secondary","Selective Area","No","Academy","2014-09-01"]
["Tealby School",9252197,120480,"West Lindsey District Council","LN8 3XU","Primary","Primary","-","-","Maintained","-"]
["Tetford The Edward Richardson Primary School",9252198,120481,"East Lindsey District Council","LN9 6QQ","Primary","Primary","-","-","Maintained","-"]
["Tetney Primary School",9252199,120482,"East Lindsey District Council","DN36 5NG","Primary","Primary","-","-","Maintained","-"]
["The Bardney Church of England and Methodist Primary School",9253154,120589,"West Lindsey District Council","LN3 5XJ","Primary","Primary","-","-","Maintained","-"]
["The Billinghay Church of England Primary School",9253007,120515,"North Kesteven District Council","LN4 4HU","Primary","Primary","-","-","Maintained","-"]
["The Boston Grammar School",9255424,139180,"Boston Borough Council","PE21 6JY","Secondary","Secondary","Grammar","Yes","Academy","2013-01-01"]
["The Butterwick Pinchbeck's Endowed CofE Primary School",9255216,120683,"Boston Borough Council","PE22 0HU","Primary","Primary","-","-","Maintained","-"]
["The Claypole Church of England Primary School",9253078,120544,"South Kesteven District Council","NG23 5BQ","Primary","Primary","-","-","Maintained","-"]
["The Colsterworth Church of England Primary School",9252049,146279,"South Kesteven District Council","NG33 5NJ","Primary","Primary","-","-","Academy","2018-09-01"]
["The Cowbit St Mary's (Endowed) CofE Primary",9253337,120611,"South Holland District Council","PE12 6AE","Primary","Primary","-","-","Maintained","-"]
["The Deepings School",9254010,137873,"South Kesteven District Council","PE6 8NF","Secondary","Secondary","Comprehensive","Yes","Academy","2012-02-01"]
["The Donington Cowley Endowed Primary School",9253098,120556,"South Holland District Council","PE11 4TR","Primary","Primary","-","-","Maintained","-"]
["The Donington-on-Bain School",9252149,120444,"East Lindsey District Council","LN11 9TJ","Primary","Primary","-","-","Maintained","-"]
["The Edenham Church of England School",9253022,143259,"South Kesteven District Council","PE10 0LP","Primary","Primary","-","-","Academy","2016-10-01"]
["The Eresby School, Spilsby",9257024,139625,"East Lindsey District Council","PE23 5HU","Special","Special","-","-","Academy","2013-05-01"]
["The Gainsborough Academy",9254043,145954,"West Lindsey District Council","DN21 1PB","Secondary","Secondary","Selective Area","No","Academy","2018-06-01"]
["The Gainsborough Charles Baines Community Primary School",9252214,120492,"West Lindsey District Council","DN21 1TE","Primary","Primary","-","-","Maintained","-"]
["The Gainsborough Hillcrest Early Years Academy",9252208,138330,"West Lindsey District Council","DN21 1SW","Primary","Infant","-","-","Academy","2012-07-01"]
["The Gainsborough Nursery School",9251011,126563,"West Lindsey District Council","DN21 2RR","Nursery","Nursery","-","-","Maintained","-"]
["The Gainsborough Parish Church Primary School",9253354,138640,"West Lindsey District Council","DN21 2LN","Primary","Primary","-","-","Academy","2012-09-01"]
["The Gedney Hill Church of England Primary School",9253088,120548,"South Holland District Council","PE12 0NL","Primary","Primary","-","-","Maintained","-"]
["The Giles Academy",9254052,148185,"Boston Borough Council","PE22 9LD","Secondary","Secondary","Selective Area","Yes","Academy","2020-09-01"]
["The Grantham Sandon School",9257005,141254,"South Kesteven District Council","NG31 9AX","Special","Special","-","-","Academy","2014-09-01"]
["The Hackthorn Church of England Primary School",9253124,120572,"West Lindsey District Council","LN2 3PF","Primary","Primary","-","-","Maintained","-"]
["The Harlaxton Church of England Primary School",9253031,120525,"South Kesteven District Council","NG32 1HT","Primary","Primary","-","-","Maintained","-"]
["The Holbeach St Mark's Church of England Primary School",9253089,120549,"South Holland District Council","PE12 8DZ","Primary","Primary","-","-","Maintained","-"]
["The Holbeach William Stukeley Church of England Voluntary Aided Primary School",9253167,120596,"South Holland District Council","PE12 7HG","Primary","Primary","-","-","Maintained","-"]
["The Horncastle St Lawrence School",9257021,142308,"East Lindsey District Council","LN9 5EJ","Special","Special","-","-","Academy","2015-09-01"]
["The Kirkby-la-Thorpe Church of England Primary School",9253036,140445,"North Kesteven District Council","NG34 9NU","Primary","Primary","-","-","Academy","2013-12-01"]
["The Kirkby-on-Bain Church of England Primary School",9253359,120623,"East Lindsey District Council","LN10 6YW","Primary","Primary","-","-","Maintained","-"]
["The Leasingham St Andrew's Church of England Primary School",9253037,120528,"North Kesteven District Council","NG34 8JS","Primary","Primary","-","-","Maintained","-"]
["The Lincoln Bishop King Church of England Primary School",9253505,120630,"City of Lincoln Council","LN5 8EU","Primary","Primary","-","-","Maintained","-"]
["The Lincoln Manor Leas Infants School",9252137,138149,"City of Lincoln Council","LN6 8BE","Primary","Infant","-","-","Academy","2012-06-01"]
["The Lincoln Manor Leas Junior School",9252136,139470,"City of Lincoln Council","LN6 8BE","Primary","Junior","-","-","Academy","2013-04-01"]
["The Lincoln St Christopher's School",9257015,120754,"City of Lincoln Council","LN6 8AR","Special","Special","-","-","Maintained","-"]
["The Lincoln St Giles Nursery School",9251005,120365,"City of Lincoln Council","LN2 4LQ","Nursery","Nursery","-","-","Maintained","-"]
["The Lincoln St Peter at Gowts Church of England Primary School",9253111,120563,"City of Lincoln Council","LN5 7TA","Primary","Primary","-","-","Maintained","-"]
["The Lincoln St Peter-In-Eastgate Church of England (Controlled) Infants School",9253105,120560,"City of Lincoln Council","LN2 4AW","Primary","Infant","-","-","Maintained","-"]
["The Mareham-le-Fen Church of England Primary School",9253130,120576,"East Lindsey District Council","PE22 7QB","Primary","Primary","-","-","Maintained","-"]
["The Market Rasen Church of England Primary School",9253131,120577,"West Lindsey District Council","LN8 3BL","Primary","Primary","-","-","Maintained","-"]
["The Marston Thorold's Charity Church of England School",9253321,120605,"South Kesteven District Council","NG32 2HQ","Primary","Primary","-","-","Maintained","-"]
["The Marton Academy",9252175,144912,"West Lindsey District Council","DN21 5AG","Primary","Primary","-","-","Academy","2017-09-01"]
["The Metheringham Primary School",9252030,120382,"North Kesteven District Council","LN4 3BX","Primary","Primary","-","-","Maintained","-"]
["The Middle Rasen Primary School",9252176,120463,"West Lindsey District Council","LN8 3TS","Primary","Primary","-","-","Maintained","-"]
["The Morton Church of England (Controlled) Primary School",9253044,143256,"South Kesteven District Council","PE10 0NN","Primary","Primary","-","-","Academy","2016-09-01"]
["The Nettleham Church of England Voluntary Aided Junior School",9253364,120626,"West Lindsey District Council","LN2 2PE","Primary","Junior","-","-","Maintained","-"]
["The Nettleham Infant and Nursery School",9255223,138639,"West Lindsey District Council","LN2 2NT","Primary","Infant","-","-","Academy","2012-09-01"]
["The New Leake Primary School",9252179,120466,"East Lindsey District Council","PE22 8JB","Primary","Primary","-","-","Maintained","-"]
["The North Cotes Church of England Primary School",9253133,120579,"East Lindsey District Council","DN36 5UZ","Primary","Primary","-","-","Maintained","-"]
["The North Hykeham All Saints Church of England Primary School",9253047,120533,"North Kesteven District Council","LN6 9AB","Primary","Primary","-","-","Maintained","-"]
["The Old Leake Primary and Nursery School",9255215,120682,"Boston Borough Council","PE22 9HR","Primary","Primary","-","-","Maintained","-"]
["The Pinchbeck East Church of England Primary Academy",9253091,148372,"South Holland District Council","PE11 3RP","Primary","Primary","-","-","Academy","2021-03-01"]
["The Potterhanworth Church of England Primary School",9253050,120534,"North Kesteven District Council","LN4 2DT","Primary","Primary","-","-","Maintained","-"]
["The Priory Ruskin Academy",9256910,136194,"South Kesteven District Council","NG31 8ED","Secondary","Secondary","Selective Area","Yes","Academy","2010-09-01"]
["The Ropsley Church of England Primary School",9253052,120536,"South Kesteven District Council","NG33 4BT","Primary","Primary","-","-","Maintained","-"]
["The Sibsey Free Primary School",9253170,120628,"East Lindsey District Council","PE22 0RR","Primary","Primary","-","-","Maintained","-"]
["The South Hykeham Community Primary School",9252039,120388,"North Kesteven District Council","LN6 9PG","Primary","Primary","-","-","Maintained","-"]
["The Spalding Monkshouse Primary School",9252114,120425,"South Holland District Council","PE11 1LG","Primary","Primary","-","-","Maintained","-"]
["The Spalding Parish Church of England Day School",9252077,147520,"South Holland District Council","PE11 2QG","Primary","Primary","-","-","Academy","2019-12-01"]
["The Spalding St John the Baptist Church of England Primary School",9253339,120613,"South Holland District Council","PE11 1JQ","Primary","Primary","-","-","Maintained","-"]
["The Tattershall Primary School",9252215,120493,"East Lindsey District Council","LN4 4QZ","Primary","Primary","-","-","Maintained","-"]
["The Tydd St Mary Church of England Primary School",9253340,120614,"South Holland District Council","PE13 5QY","Primary","Primary","-","-","Maintained","-"]
["The Uffington Church of England Primary School",9253070,120541,"South Kesteven District Council","PE9 4SU","Primary","Primary","-","-","Maintained","-"]
["The Utterby Primary Academy",9252202,139885,"East Lindsey District Council","LN11 0TN","Primary","Primary","-","-","Academy","2013-07-01"]
["The Wainfleet Magdalen Church of England/Methodist School",9252015,140185,"East Lindsey District Council","PE24 4DD","Primary","Primary","-","-","Academy","2014-04-01"]
["The Welbourn Church of England Primary School",9253071,120542,"North Kesteven District Council","LN5 0NH","Primary","Primary","-","-","Maintained","-"]
["Theddlethorpe Academy",9252040,143132,"East Lindsey District Council","LN12 1PB","Primary","Primary","-","-","Academy","2016-09-01"]
["Thomas Middlecott Academy",9254013,141391,"Boston Borough Council","PE20 1JS","Secondary","Secondary","Selective Area","No","Academy","2015-03-01"]
["Thorpe on the Hill The St Michael's Church of England Primary School",9253068,120540,"North Kesteven District Council","LN6 9BN","Primary","Primary","-","-","Maintained","-"]
["Thurlby Community Primary Academy",9252069,147153,"South Kesteven District Council","PE10 0EZ","Primary","Primary","-","-","Academy","2020-01-01"]
["Toynton All Saints Primary School",9252201,120483,"East Lindsey District Council","PE23 5AQ","Primary","Primary","-","-","Maintained","-"]
["Tulip Academy",9257009,142667,"South Holland District Council","PE11 2EH","Special","Special","-","-","Academy","2016-03-01"]
["University Academy Holbeach",9254001,137282,"South Holland District Council","PE12 7PU","Secondary","Secondary","Selective Area","Yes","Academy","2011-09-01"]
["University Academy Long Sutton",9254044,147268,"South Holland District Council","PE12 9LF","Secondary","Secondary","Selective Area","No","Academy","2019-07-01"]
["Waddingham Primary School",9252203,120485,"West Lindsey District Council","DN21 4SX","Primary","Primary","-","-","Maintained","-"]
["Waddington All Saints Academy",9252240,145358,"North Kesteven District Council","LN5 9NX","Primary","Primary","-","-","Academy","2018-01-01"]
["Waddington Redwood Primary Academy",9252061,146203,"North Kesteven District Council","LN5 9BN","Primary","Primary","-","-","Academy","2018-09-01"]
["Walcott Primary School",9252050,120391,"North Kesteven District Council","LN4 3SX","Primary","Primary","-","-","Maintained","-"]
["Washingborough Academy",9255212,137977,"North Kesteven District Council","LN4 1BW","Primary","Primary","-","-","Academy","2012-04-01"]
["Welton St Mary's Church of England Primary Academy",9253158,139187,"West Lindsey District Council","LN2 3LA","Primary","Primary","-","-","Academy","2013-01-01"]
["West Grantham Church of England Primary Academy",9252099,148432,"South Kesteven District Council","NG31 7XQ","Primary","Primary","-","-","Academy","2021-01-01"]
["West Grantham Church of England Secondary Academy",9254053,148433,"South Kesteven District Council","NG31 7PX","Secondary","Secondary","Selective Area","No","Academy","2021-01-01"]
["Weston Hills CofE Primary School",9253096,120554,"South Holland District Council","PE12 6DL","Primary","Primary","-","-","Maintained","-"]
["Weston St Mary Church of England Primary School",9252023,140988,"South Holland District Council","PE12 6HU","Primary","Primary","-","-","Academy","2014-09-01"]
["Whaplode Church of England Primary School",9253097,144119,"South Holland District Council","PE12 6TS","Primary","Primary","-","-","Academy","2017-12-01"]
["White's Wood Academy",9252207,139361,"West Lindsey District Council","DN21 1TJ","Primary","Junior","-","-","Academy","2013-03-01"]
["William Farr CofE Comprehensive School",9255415,136415,"West Lindsey District Council","LN2 3JB","Secondary","Secondary","Comprehensive","Yes","Academy","2011-01-01"]
["William Lovell Church of England Academy",9254516,138756,"East Lindsey District Council","PE22 8AA","Secondary","Secondary","Selective Area","No","Academy","2012-09-01"]
["Willoughby St Helena's Church of England Primary School",9253151,120587,"East Lindsey District Council","LN13 9NH","Primary","Primary","-","-","Maintained","-"]
["Willoughton Primary School",9252205,120487,"West Lindsey District Council","DN21 5RT","Primary","Primary","-","-","Maintained","-"]
["Witham Hall School",9256015,120727,"South Kesteven District Council","PE10 0JJ","Not applicable","Not applicable",null,"No","Independent","1960-02-22"]
["Witham Prospect School",9256011,146971,"North Kesteven District Council","LN6 9JR","Not applicable","Not applicable","Special","No","Independent","2019-05-30"]
["Witham St Hughs Academy",9253506,137978,"North Kesteven District Council","LN6 9WF","Primary","Primary","-","-","Academy","2012-04-01"]
["Withern The St Margaret's Church of England School",9253152,120588,"East Lindsey District Council","LN13 0NB","Primary","Primary","-","-","Maintained","-"]
["Woodhall Spa St Andrew's CofE Primary School",9255208,138487,"East Lindsey District Council","LN10 6RQ","Primary","Primary","-","-","Academy","2012-08-01"]
["Woodlands Academy",9257030,142510,"East Lindsey District Council","PE23 5EJ","Special","Special","-","-","Academy","2016-08-01"]
["Wragby Primary School",9252206,120488,"East Lindsey District Council","LN8 5PJ","Primary","Primary","-","-","Maintained","-"]
["Wrangle Primary School",9255218,120685,"Boston Borough Council","PE22 9AS","Primary","Primary","-","-","Maintained","-"]
["Wyberton Primary Academy",9255214,146916,"Boston Borough Council","PE21 7BZ","Primary","Primary","-","-","Academy","2019-04-01"]
["Wygate Park Academy",9252021,140498,"South Holland District Council","PE11 3WT","Primary","Primary","-","-","Academy","2014-09-01"]

{"sheet":"Import T1","index":6,"n_rows":53,"n_cols":49,"rows_kept":53,"cut":false,"hidden":true,"merged":[]}
["Term 1"]
[{"$f":"'23-24 Term 1'!C4:I4","v":"Swinderby All Saints Church of England Primary School"},0,0,0,0,0,0]
[{"$f":"'23-24 Term 1'!C5:G5","v":"Zoe Longstaff"},0,0,0,0]
[{"$f":"'23-24 Term 1'!J5","v":"Yes"}]
[{"$f":"'23-24 Term 1'!C6:J6","v":"Michelle Waddell"},0,0,0,0,0,0,0]
[{"$f":"'23-24 Term 1'!C7:J7","v":"Tracey Sims"},0,0,0,0,0,0,0]
[{"$f":"'23-24 Term 1'!C8:F8","v":"zoe.longstaff@swinderby.lincs.sch.uk"},0,0,0]
[{"$f":"'23-24 Term 1'!H8:J8","v":"00:00:00"},0,0]
[{"$f":"'23-24 Term 1'!H10","v":"Primary"}]
[{"$f":"'23-24 Term 1'!H11","v":"Maintained"}]
[{"$f":"'23-24 Term 1'!B14:E14","v":"Monitor attendance of all EHCP, SEN, PP & other vulnerable children"},0,0,0]
[{"$f":"'23-24 Term 1'!B15:E15","v":"Weekly monitoring of attendance & actions accordingly"},0,0,0]
[{"$f":"'23-24 Term 1'!B16:E16","v":"Half termly attendance letters to all children"},0,0,0]
[{"$f":"'23-24 Term 1'!B17:E17","v":"Reduce the number of Persistent Absentees with the school"},0,0,0]
[{"$f":"'23-24 Term 1'!B18:E18","v":0},0,0,0]
[{"$f":"'23-24 Term 1'!B19:E19","v":0},0,0,0]
[{"$f":"'23-24 Term 1'!B20:E20","v":0},0,0,0]
[{"$f":"'23-24 Term 1'!F23","v":"Yes"}]
[{"$f":"'23-24 Term 1'!F24","v":"Yes"}]
[{"$f":"'23-24 Term 1'!F25","v":"Yes"}]
[{"$f":"'23-24 Term 1'!C32","v":0}]
[{"$f":"'23-24 Term 1'!D32","v":1}]
[{"$f":"'23-24 Term 1'!E32","v":5}]
[{"$f":"'23-24 Term 1'!F32","v":5}]
[{"$f":"'23-24 Term 1'!G32","v":81}]
[{"$f":"'23-24 Term 1'!I33","v":96.49}]
[{"$f":"'23-24 Term 1'!B34","v":"All Lincs PRI Schools"}]
[{"$f":"'23-24 Term 1'!C45:J45","v":"* Looking at any potential patterns of absence\n* Reporting on newsletters, on the school website, directly to parents and staff (individual classes & whole school)\n* Contacting parents when children absent, bringing children into school (if missed bus for e.g.), administer any medicine\n* Half termly letters to all pupils\n* Staff updated regularly\n"},0,0,0,0,0,0,0]
[{"$f":"'23-24 Term 1'!C46:J46","v":"* 1x child off with COVID\n* 1x child with anxiety around school. Working with parents. In school daily but late\n* 1x child on TAC - child brought into school by HT if needs be. \n* 1x Y6 child - warning letters have been issued and parents invited in for meeting with Head\n* 1x Y6 child had a lot of illness at start of year. No concerns as attendance has been high throughout previous years\n"},0,0,0,0,0,0,0]
[{"$f":"'23-24 Term 1'!C47:J47","v":"* 1x YR child temporary timetable at very start of academic year (first 2 weeks only) and illness\n* 2x children with unauthorised holiday. Fined and paid immediately\n* 2x children with unauthorised holiday, did not fine due to higher attendance previous year but warning letter. Younger sibling not of compulsory school age\n* \n* \n"},0,0,0,0,0,0,0]
[{"$f":"'23-24 Term 1'!C48:J48","v":"* 1x EHCP child, complex medical needs. School to complete Early Help Assessment to support parents. Referral to WTT, Specialist nurse. \n* \n* \n* \n* \n"},0,0,0,0,0,0,0]
[{"$f":"'23-24 Term 1'!C49:J49","v":"* \n* \n* \n* \n* \n"},0,0,0,0,0,0,0]
[{"$f":"'23-24 Term 1'!C53:J53","v":"* 90.4%. Complex medical needs. School to complete Early Help Assessment to support parents. Referral to WTT and Special nurse\n* \n* \n* \n* \n"},0,0,0,0,0,0,0]
[{"$f":"'23-24 Term 1'!C54:J54","v":"* \n* \n* \n* \n* \n"},0,0,0,0,0,0,0]
[{"$f":"'23-24 Term 1'!C55:J55","v":"* 1x Y5 child - school refuser. EP involvement, TAC, community Paediatrics  and Healthy Minds\n* \n* \n* \n* \n"},0,0,0,0,0,0,0]
[{"$f":"'23-24 Term 1'!C57:J57","v":"* \n* \n* \n* \n* \n"},0,0,0,0,0,0,0]
[{"$f":"'23-24 Term 1'!C58:J58","v":"* No Concerns\n* \n* \n* \n* \n"},0,0,0,0,0,0,0]
[{"$f":"'23-24 Term 1'!C59:J59","v":"* No Concerns\n* \n* \n* \n* \n"},0,0,0,0,0,0,0]
[{"$f":"'23-24 Term 1'!C60:J60","v":"* 1x Y1 child left July 2023 to be home schooled. This was due to religious reasons. Reported to LCC\n* \n* \n* \n* \n"},0,0,0,0,0,0,0]
[{"$f":"'23-24 Term 1'!C61:E61","v":0},0,0]
[{"$f":"'23-24 Term 1'!I61:J61","v":0},0]
[{"$f":"'23-24 Term 1'!B65:J65","v":"* High levels of monitoring\n* Effective use of attendance policy\n* Rigorour and consistent approach to following up concerns\n* Introduction of fining\n* Making good use of external agencies to support families and pupils\n"},0,0,0,0,0,0,0,0]
[{"$f":"'23-24 Term 1'!B69:J69","v":"Continue to be vigilant and rigorous in application of attendance policy"},0,0,0,0,0,0,0,0]
[{"$f":"'23-24 Term 1'!B70:J70","v":"Monitor the impact of fining"},0,0,0,0,0,0,0,0]
[{"$f":"'23-24 Term 1'!B71:J71","v":"Ensure families needing support are placed on Early Help Form and help sought"},0,0,0,0,0,0,0,0]
[{"$f":"'23-24 Term 1'!B72:J72","v":0},0,0,0,0,0,0,0,0]
[{"$f":"'23-24 Term 1'!B73:J73","v":0},0,0,0,0,0,0,0,0]
[{"$f":"'23-24 Term 1'!B74:J74","v":0},0,0,0,0,0,0,0,0]
[{"$f":"'23-24 Term 1'!B75:J75","v":0},0,0,0,0,0,0,0,0]
[]
[]
["Line to import below 23-23 T1"]
[{"$f":"A1","v":"Term 1"},{"$f":"A2","v":"Swinderby All Saints Church of England Primary School"},{"$f":"A3","v":"Zoe Longstaff"},{"$f":"A4","v":"Yes"},{"$f":"A5","v":"Michelle Waddell"},{"$f":"A6","v":"Tracey Sims"},{"$f":"A7","v":"zoe.longstaff@swinderby.lincs.sch.uk"},{"$f":"A8","v":"00:00:00"},{"$f":"A9","v":"Primary"},{"$f":"A10","v":"Maintained"},{"$f":"A11","v":"Monitor attendance of all EHCP, SEN, PP & other vulnerable children"},{"$f":"A12","v":"Weekly monitoring of attendance & actions accordingly"},{"$f":"A13","v":"Half termly attendance letters to all children"},{"$f":"A14","v":"Reduce the number of Persistent Absentees with the school"},{"$f":"A15","v":0},{"$f":"A16","v":0},{"$f":"A17","v":0},{"$f":"A18","v":"Yes"},{"$f":"A19","v":"Yes"},{"$f":"A20","v":"Yes"},{"$f":"A21","v":0},{"$f":"A22","v":1},{"$f":"A23","v":5},{"$f":"A24","v":5},{"$f":"A25","v":81},{"$f":"A26","v":96.49},{"$f":"A27","v":"All Lincs PRI Schools"},{"$f":"A28","v":"* Looking at any potential patterns of absence\n* Reporting on newsletters, on the school website, directly to parents and staff (individual classes & whole school)\n* Contacting parents when children absent, bringing children into school (if missed bus for e.g.), administer any medicine\n* Half termly letters to all pupils\n* Staff updated regularly\n"},{"$f":"A29","v":"* 1x child off with COVID\n* 1x child with anxiety around school. Working with parents. In school daily but late\n* 1x child on TAC - child brought into school by HT if needs be. \n* 1x Y6 child - warning letters have been issued and parents invited in for meeting with Head\n* 1x Y6 child had a lot of illness at start of year. No concerns as attendance has been high throughout previous years\n"},{"$f":"A30","v":"* 1x YR child temporary timetable at very start of academic year (first 2 weeks only) and illness\n* 2x children with unauthorised holiday. Fined and paid immediately\n* 2x children with unauthorised holiday, did not fine due to higher attendance previous year but warning letter. Younger sibling not of compulsory school age\n* \n* \n"},{"$f":"A31","v":"* 1x EHCP child, complex medical needs. School to complete Early Help Assessment to support parents. Referral to WTT, Specialist nurse. \n* \n* \n* \n* \n"},{"$f":"A32","v":"* \n* \n* \n* \n* \n"},{"$f":"A33","v":"* 90.4%. Complex medical needs. School to complete Early Help Assessment to support parents. Referral to WTT and Special nurse\n* \n* \n* \n* \n"},{"$f":"A34","v":"* \n* \n* \n* \n* \n"},{"$f":"A35","v":"* 1x Y5 child - school refuser. EP involvement, TAC, community Paediatrics  and Healthy Minds\n* \n* \n* \n* \n"},{"$f":"A36","v":"* \n* \n* \n* \n* \n"},{"$f":"A37","v":"* No Concerns\n* \n* \n* \n* \n"},{"$f":"A38","v":"* No Concerns\n* \n* \n* \n* \n"},{"$f":"A39","v":"* 1x Y1 child left July 2023 to be home schooled. This was due to religious reasons. Reported to LCC\n* \n* \n* \n* \n"},{"$f":"A40","v":0},{"$f":"A41","v":0},{"$f":"A42","v":"* High levels of monitoring\n* Effective use of attendance policy\n* Rigorour and consistent approach to following up concerns\n* Introduction of fining\n* Making good use of external agencies to support families and pupils\n"},{"$f":"A43","v":"Continue to be vigilant and rigorous in application of attendance policy"},{"$f":"A44","v":"Monitor the impact of fining"},{"$f":"A45","v":"Ensure families needing support are placed on Early Help Form and help sought"},{"$f":"A46","v":0},{"$f":"A47","v":0},{"$f":"A48","v":0},{"$f":"A49","v":0}]

{"sheet":"Import T2","index":7,"n_rows":53,"n_cols":49,"rows_kept":53,"cut":false,"hidden":true,"merged":[]}
["Term 2"]
[{"$f":"'23-24 Term 2'!C4:I4","v":"Click in cell and use drop-down arrow on right to select school"},0,0,0,0,0,0]
[{"$f":"'23-24 Term 2'!C5:G5","v":0},0,0,0,0]
[{"$f":"'23-24 Term 2'!J5","v":"Select"}]
[{"$f":"'23-24 Term 2'!C6:J6","v":0},0,0,0,0,0,0,0]
[{"$f":"'23-24 Term 2'!C7:J7","v":0},0,0,0,0,0,0,0]
[{"$f":"'23-24 Term 2'!C8:F8","v":0},0,0,0]
[{"$f":"'23-24 Term 2'!H8:J8","v":"00:00:00"},0,0]
[{"$f":"'23-24 Term 2'!H10","v":""}]
[{"$f":"'23-24 Term 2'!H11","v":""}]
[{"$f":"'23-24 Term 2'!B14:E14","v":0},0,0,0]
[{"$f":"'23-24 Term 2'!B15:E15","v":0},0,0,0]
[{"$f":"'23-24 Term 2'!B16:E16","v":0},0,0,0]
[{"$f":"'23-24 Term 2'!B17:E17","v":0},0,0,0]
[{"$f":"'23-24 Term 2'!B18:E18","v":0},0,0,0]
[{"$f":"'23-24 Term 2'!B19:E19","v":0},0,0,0]
[{"$f":"'23-24 Term 2'!B20:E20","v":0},0,0,0]
[{"$f":"'23-24 Term 2'!F23","v":"Select"}]
[{"$f":"'23-24 Term 2'!F24","v":"Select"}]
[{"$f":"'23-24 Term 2'!F25","v":"Select"}]
[{"$f":"'23-24 Term 2'!C32","v":0}]
[{"$f":"'23-24 Term 2'!D32","v":0}]
[{"$f":"'23-24 Term 2'!E32","v":0}]
[{"$f":"'23-24 Term 2'!F32","v":0}]
[{"$f":"'23-24 Term 2'!G32","v":0}]
[{"$f":"'23-24 Term 2'!I33","v":0}]
[{"$f":"'23-24 Term 2'!B34","v":"**  Select Phase  **"}]
[{"$f":"'23-24 Term 2'!C45:J45","v":"* \n* \n* \n* \n* \n"},0,0,0,0,0,0,0]
[{"$f":"'23-24 Term 2'!C46:J46","v":"* \n* \n* \n* \n* \n"},0,0,0,0,0,0,0]
[{"$f":"'23-24 Term 2'!C47:J47","v":"* \n* \n* \n* \n* \n"},0,0,0,0,0,0,0]
[{"$f":"'23-24 Term 2'!C48:J48","v":"* \n* \n* \n* \n* \n"},0,0,0,0,0,0,0]
[{"$f":"'23-24 Term 2'!C49:J49","v":"* \n* \n* \n* \n* \n"},0,0,0,0,0,0,0]
[{"$f":"'23-24 Term 2'!C53:J53","v":"* \n* \n* \n* \n* \n"},0,0,0,0,0,0,0]
[{"$f":"'23-24 Term 2'!C54:J54","v":"* \n* \n* \n* \n* \n"},0,0,0,0,0,0,0]
[{"$f":"'23-24 Term 2'!C55:J55","v":"* \n* \n* \n* \n* \n"},0,0,0,0,0,0,0]
[{"$f":"'23-24 Term 2'!C57:J57","v":"* \n* \n* \n* \n* \n"},0,0,0,0,0,0,0]
[{"$f":"'23-24 Term 2'!C58:J58","v":"* \n* \n* \n* \n* \n"},0,0,0,0,0,0,0]
[{"$f":"'23-24 Term 2'!C59:J59","v":"* \n* \n* \n* \n* \n"},0,0,0,0,0,0,0]
[{"$f":"'23-24 Term 2'!C60:J60","v":"* \n* \n* \n* \n* \n"},0,0,0,0,0,0,0]
[{"$f":"'23-24 Term 2'!C61:E61","v":0},0,0]
[{"$f":"'23-24 Term 2'!I61:J61","v":0},0]
[{"$f":"'23-24 Term 2'!B65:J65","v":"* \n* \n* \n* \n* \n"},0,0,0,0,0,0,0,0]
[{"$f":"'23-24 Term 2'!B69:J69","v":0},0,0,0,0,0,0,0,0]
[{"$f":"'23-24 Term 2'!B70:J70","v":0},0,0,0,0,0,0,0,0]
[{"$f":"'23-24 Term 2'!B71:J71","v":0},0,0,0,0,0,0,0,0]
[{"$f":"'23-24 Term 2'!B72:J72","v":0},0,0,0,0,0,0,0,0]
[{"$f":"'23-24 Term 2'!B73:J73","v":0},0,0,0,0,0,0,0,0]
[{"$f":"'23-24 Term 2'!B74:J74","v":0},0,0,0,0,0,0,0,0]
[{"$f":"'23-24 Term 2'!B75:J75","v":0},0,0,0,0,0,0,0,0]
[]
[]
["Line to import below 23-23 T2"]
[{"$f":"A1","v":"Term 2"},{"$f":"A2","v":"Click in cell and use drop-down arrow on right to select school"},{"$f":"A3","v":0},{"$f":"A4","v":"Select"},{"$f":"A5","v":0},{"$f":"A6","v":0},{"$f":"A7","v":0},{"$f":"A8","v":"00:00:00"},{"$f":"A9","v":""},{"$f":"A10","v":""},{"$f":"A11","v":0},{"$f":"A12","v":0},{"$f":"A13","v":0},{"$f":"A14","v":0},{"$f":"A15","v":0},{"$f":"A16","v":0},{"$f":"A17","v":0},{"$f":"A18","v":"Select"},{"$f":"A19","v":"Select"},{"$f":"A20","v":"Select"},{"$f":"A21","v":0},{"$f":"A22","v":0},{"$f":"A23","v":0},{"$f":"A24","v":0},{"$f":"A25","v":0},{"$f":"A26","v":0},{"$f":"A27","v":"**  Select Phase  **"},{"$f":"A28","v":"* \n* \n* \n* \n* \n"},{"$f":"A29","v":"* \n* \n* \n* \n* \n"},{"$f":"A30","v":"* \n* \n* \n* \n* \n"},{"$f":"A31","v":"* \n* \n* \n* \n* \n"},{"$f":"A32","v":"* \n* \n* \n* \n* \n"},{"$f":"A33","v":"* \n* \n* \n* \n* \n"},{"$f":"A34","v":"* \n* \n* \n* \n* \n"},{"$f":"A35","v":"* \n* \n* \n* \n* \n"},{"$f":"A36","v":"* \n* \n* \n* \n* \n"},{"$f":"A37","v":"* \n* \n* \n* \n* \n"},{"$f":"A38","v":"* \n* \n* \n* \n* \n"},{"$f":"A39","v":"* \n* \n* \n* \n* \n"},{"$f":"A40","v":0},{"$f":"A41","v":0},{"$f":"A42","v":"* \n* \n* \n* \n* \n"},{"$f":"A43","v":0},{"$f":"A44","v":0},{"$f":"A45","v":0},{"$f":"A46","v":0},{"$f":"A47","v":0},{"$f":"A48","v":0},{"$f":"A49","v":0}]

{"sheet":"Import T3","index":8,"n_rows":53,"n_cols":49,"rows_kept":53,"cut":false,"hidden":true,"merged":[]}
["Term 3"]
[{"$f":"'23-24 Term 3'!C4:I4","v":"Click in cell and use drop-down arrow on right to select school"},0,0,0,0,0,0]
[{"$f":"'23-24 Term 3'!C5:G5","v":0},0,0,0,0]
[{"$f":"'23-24 Term 3'!J5","v":"Select"}]
[{"$f":"'23-24 Term 3'!C6:J6","v":0},0,0,0,0,0,0,0]
[{"$f":"'23-24 Term 3'!C7:J7","v":0},0,0,0,0,0,0,0]
[{"$f":"'23-24 Term 3'!C8:F8","v":0},0,0,0]
[{"$f":"'23-24 Term 3'!H8:J8","v":"00:00:00"},0,0]
[{"$f":"'23-24 Term 3'!H10","v":""}]
[{"$f":"'23-24 Term 3'!H11","v":""}]
[{"$f":"'23-24 Term 3'!B14:E14","v":0},0,0,0]
[{"$f":"'23-24 Term 3'!B15:E15","v":0},0,0,0]
[{"$f":"'23-24 Term 3'!B16:E16","v":0},0,0,0]
[{"$f":"'23-24 Term 3'!B17:E17","v":0},0,0,0]
[{"$f":"'23-24 Term 3'!B18:E18","v":0},0,0,0]
[{"$f":"'23-24 Term 3'!B19:E19","v":0},0,0,0]
[{"$f":"'23-24 Term 3'!B20:E20","v":0},0,0,0]
[{"$f":"'23-24 Term 3'!F23","v":"Select"}]
[{"$f":"'23-24 Term 3'!F24","v":"Select"}]
[{"$f":"'23-24 Term 3'!F25","v":"Select"}]
[{"$f":"'23-24 Term 3'!C32","v":0}]
[{"$f":"'23-24 Term 3'!D32","v":0}]
[{"$f":"'23-24 Term 3'!E32","v":0}]
[{"$f":"'23-24 Term 3'!F32","v":0}]
[{"$f":"'23-24 Term 3'!G32","v":0}]
[{"$f":"'23-24 Term 3'!I33","v":0}]
[{"$f":"'23-24 Term 3'!B34","v":"**  Select Phase  **"}]
[{"$f":"'23-24 Term 3'!C45:J45","v":"* \n* \n* \n* \n* \n"},0,0,0,0,0,0,0]
[{"$f":"'23-24 Term 3'!C46:J46","v":"* \n* \n* \n* \n* \n"},0,0,0,0,0,0,0]
[{"$f":"'23-24 Term 3'!C47:J47","v":"* \n* \n* \n* \n* \n"},0,0,0,0,0,0,0]
[{"$f":"'23-24 Term 3'!C48:J48","v":"* \n* \n* \n* \n* \n"},0,0,0,0,0,0,0]
[{"$f":"'23-24 Term 3'!C49:J49","v":"* \n* \n* \n* \n* \n"},0,0,0,0,0,0,0]
[{"$f":"'23-24 Term 3'!C53:J53","v":"* \n* \n* \n* \n* \n"},0,0,0,0,0,0,0]
[{"$f":"'23-24 Term 3'!C54:J54","v":"* \n* \n* \n* \n* \n"},0,0,0,0,0,0,0]
[{"$f":"'23-24 Term 3'!C55:J55","v":"* \n* \n* \n* \n* \n"},0,0,0,0,0,0,0]
[{"$f":"'23-24 Term 3'!C57:J57","v":"* \n* \n* \n* \n* \n"},0,0,0,0,0,0,0]
[{"$f":"'23-24 Term 3'!C58:J58","v":"* \n* \n* \n* \n* \n"},0,0,0,0,0,0,0]
[{"$f":"'23-24 Term 3'!C59:J59","v":"* \n* \n* \n* \n* \n"},0,0,0,0,0,0,0]
[{"$f":"'23-24 Term 3'!C60:J60","v":"* \n* \n* \n* \n* \n"},0,0,0,0,0,0,0]
[{"$f":"'23-24 Term 3'!C61:E61","v":0},0,0]
[{"$f":"'23-24 Term 3'!I61:J61","v":0},0]
[{"$f":"'23-24 Term 3'!B65:J65","v":"* \n* \n* \n* \n* \n"},0,0,0,0,0,0,0,0]
[{"$f":"'23-24 Term 3'!B69:J69","v":0},0,0,0,0,0,0,0,0]
[{"$f":"'23-24 Term 3'!B70:J70","v":0},0,0,0,0,0,0,0,0]
[{"$f":"'23-24 Term 3'!B71:J71","v":0},0,0,0,0,0,0,0,0]
[{"$f":"'23-24 Term 3'!B72:J72","v":0},0,0,0,0,0,0,0,0]
[{"$f":"'23-24 Term 3'!B73:J73","v":0},0,0,0,0,0,0,0,0]
[{"$f":"'23-24 Term 3'!B74:J74","v":0},0,0,0,0,0,0,0,0]
[{"$f":"'23-24 Term 3'!B75:J75","v":0},0,0,0,0,0,0,0,0]
[]
[]
["Line to import below 23-23 T3"]
[{"$f":"A1","v":"Term 3"},{"$f":"A2","v":"Click in cell and use drop-down arrow on right to select school"},{"$f":"A3","v":0},{"$f":"A4","v":"Select"},{"$f":"A5","v":0},{"$f":"A6","v":0},{"$f":"A7","v":0},{"$f":"A8","v":"00:00:00"},{"$f":"A9","v":""},{"$f":"A10","v":""},{"$f":"A11","v":0},{"$f":"A12","v":0},{"$f":"A13","v":0},{"$f":"A14","v":0},{"$f":"A15","v":0},{"$f":"A16","v":0},{"$f":"A17","v":0},{"$f":"A18","v":"Select"},{"$f":"A19","v":"Select"},{"$f":"A20","v":"Select"},{"$f":"A21","v":0},{"$f":"A22","v":0},{"$f":"A23","v":0},{"$f":"A24","v":0},{"$f":"A25","v":0},{"$f":"A26","v":0},{"$f":"A27","v":"**  Select Phase  **"},{"$f":"A28","v":"* \n* \n* \n* \n* \n"},{"$f":"A29","v":"* \n* \n* \n* \n* \n"},{"$f":"A30","v":"* \n* \n* \n* \n* \n"},{"$f":"A31","v":"* \n* \n* \n* \n* \n"},{"$f":"A32","v":"* \n* \n* \n* \n* \n"},{"$f":"A33","v":"* \n* \n* \n* \n* \n"},{"$f":"A34","v":"* \n* \n* \n* \n* \n"},{"$f":"A35","v":"* \n* \n* \n* \n* \n"},{"$f":"A36","v":"* \n* \n* \n* \n* \n"},{"$f":"A37","v":"* \n* \n* \n* \n* \n"},{"$f":"A38","v":"* \n* \n* \n* \n* \n"},{"$f":"A39","v":"* \n* \n* \n* \n* \n"},{"$f":"A40","v":0},{"$f":"A41","v":0},{"$f":"A42","v":"* \n* \n* \n* \n* \n"},{"$f":"A43","v":0},{"$f":"A44","v":0},{"$f":"A45","v":0},{"$f":"A46","v":0},{"$f":"A47","v":0},{"$f":"A48","v":0},{"$f":"A49","v":0}]